null
SMILES: CCCCCN1C(=O)\C(=C\NC23CC4CC(CC(C4)C2)C3)C(=O)c2cc(OC)cc(C)c12
InChI Key: InChIKey=FDEACFAXFCKCHZ-IXSHNIHPSA-N
Activity Spreadsheet -- Enzyme Inhibition Constant Data from BindingDB
Found 2 hits for monomerid = 50095902
Trg + Lig
Ki
nM
ΔG°
kcal/mole
IC50
nM
Kd
nM
EC50/IC50
nM
koff
s-1
kon
M-1s-1
pHTemp
°C
Cannabinoid receptor 2
(Homo sapiens (Human))
BDBM50095902
(CHEMBL3590298)
Show SMILES CCCCCN1C(=O)\C(=C\NC23CC4CC(CC(C4)C2)C3)C(=O)c2cc(OC)cc(C)c12 |TLB:18:13:20:17.19.16,18:17:20:12.13.14,THB:16:15:12:18.17.19,16:17:12:20.14.15|
Show InChI InChI=1S/C18H24N6O4/c1-3-5-6-7-8-10-22-15(19)11-16(23-10)24(9-21-11)18-13(26)12(25)14(28-18)17(27)20-4-2/h9,12-14,18,25-26H,3-6H2,1-2H3,(H,20,27)(H2,19,22,23)/t12-,13+,14+,18?/m1/s1
Reactome pathway
n/an/a 45n/an/an/an/an/an/a
Zhejiang University
Curated by ChEMBL
Assay Description
Antagonist activity against CB2R (unknown origin) CHO cells stably expressing Galpha16 assessed as inhibition of CP55940-induced increase in intracel...
J Med Chem 58: 5751-69 (2015)
Article DOI: 10.1021/acs.jmedchem.5b00227
BindingDB Entry DOI: 10.7270/Q2Z039X8
Cannabinoid receptor 1
(Homo sapiens (Human))
BDBM50095902
(CHEMBL3590298)
Show SMILES CCCCCN1C(=O)\C(=C\NC23CC4CC(CC(C4)C2)C3)C(=O)c2cc(OC)cc(C)c12 |TLB:18:13:20:17.19.16,18:17:20:12.13.14,THB:16:15:12:18.17.19,16:17:12:20.14.15|
Show InChI InChI=1S/C18H24N6O4/c1-3-5-6-7-8-10-22-15(19)11-16(23-10)24(9-21-11)18-13(26)12(25)14(28-18)17(27)20-4-2/h9,12-14,18,25-26H,3-6H2,1-2H3,(H,20,27)(H2,19,22,23)/t12-,13+,14+,18?/m1/s1
NCI pathway
Reactome pathway
n/an/a>1.00E+4n/an/an/an/an/an/a
Zhejiang University
Curated by ChEMBL
Assay Description
Antagonist activity against CB1R (unknown origin) CHO cells stably expressing Galpha16 assessed as inhibition of CP55940-induced increase in intracel...
J Med Chem 58: 5751-69 (2015)
Article DOI: 10.1021/acs.jmedchem.5b00227
BindingDB Entry DOI: 10.7270/Q2Z039X8