BDBM50095919 CHEMBL3590352
SMILES: [H][C@@]12CCCN1C(=O)c1cc3cc(c1)C(=O)NC[C@]([H])(NC(=O)[C@H](NC(=O)[C@H](CCCNC(N)=N)NC(=O)[C@H](CCCNC(N)=N)NC(=O)[C@H](Cc1ccc4ccccc4c1)NC(=O)[C@@]1([H])CCCCN1C(=O)[C@@H](CC(O)=O)NC(=O)CN(C)C2=O)C(C)C)C(=O)N[C@@H](Cc1ccccc1)C(=O)N[C@@H](Cc1ccc2ccccc2c1)C(=O)N[C@@H](CCCNC(N)=N)C(=O)N[C@@H](CCCNC(N)=N)C(=O)N[C@@H](CCCNC(N)=N)C(=O)N[C@@H](CCCNC(N)=N)C(=O)N[C@@H](CNC3=O)C(=O)N[C@@H](CCCCN)C(O)=O
InChI Key: InChIKey=HKNNVPKNIFQWDY-LJEUNREKSA-N
Data: 1 Kd
Activity Spreadsheet -- Enzyme Inhibition Constant Data from BindingDB
Found 1 hit for monomerid = 50095919
Trg + Lig
Ki
nM
ΔG°
kcal/mole
IC50
nM
Kd
nM
EC50/IC50
nM
koff
s-1
kon
M-1s-1
pHTemp
°C
Peptidyl-prolyl cis-trans isomerase NIMA-interacting 1
(Homo sapiens (Human))
BDBM50095919
(CHEMBL3590352)
Show SMILES [H][C@@]12CCCN1C(=O)c1cc3cc(c1)C(=O)NC[C@]([H])(NC(=O)[C@H](NC(=O)[C@H](CCCNC(N)=N)NC(=O)[C@H](CCCNC(N)=N)NC(=O)[C@H](Cc1ccc4ccccc4c1)NC(=O)[C@@]1([H])CCCCN1C(=O)[C@@H](CC(O)=O)NC(=O)CN(C)C2=O)C(C)C)C(=O)N[C@@H](Cc1ccccc1)C(=O)N[C@@H](Cc1ccc2ccccc2c1)C(=O)N[C@@H](CCCNC(N)=N)C(=O)N[C@@H](CCCNC(N)=N)C(=O)N[C@@H](CCCNC(N)=N)C(=O)N[C@@H](CCCNC(N)=N)C(=O)N[C@@H](CNC3=O)C(=O)N[C@@H](CCCCN)C(O)=O
Show InChI InChI=1S/C21H23N7O4/c1-2-24-20(31)17-15(29)16(30)21(32-17)28-11-25-14-18(22)26-13(27-19(14)28)8-9-23-10-12-6-4-3-5-7-12/h3-7,11,15-17,21,23,29-30H,2,10H2,1H3,(H,24,31)(H2,22,26,27)/t15-,16+,17+,21?/m1/s1
NCI pathway
Reactome pathway
n/an/an/a 192n/an/an/an/an/a
The Ohio State University
Curated by ChEMBL
Assay Description
Binding affinity to N-terminal MBP fused and Texas-red-labeled full-length human Pin1 S16A/Y23A mutant expressed in Escherichia coli assessed as incr...
J Med Chem 58: 6306-12 (2015)
Article DOI: 10.1021/acs.jmedchem.5b00411
BindingDB Entry DOI: 10.7270/Q2T72K6Z