BDBM50095923 CHEMBL3590360
SMILES: [H][C@]12CCCCN1C(=O)[C@]([H])(NC(=O)[C@H](Cc1ccc(F)c(F)c1)NC(=O)[C@@H](Cc1ccccc1)NC(=O)c1cc3cc(c1)C(=O)NC[C@]([H])(NC(=O)[C@@H](C)NC(=O)[C@H](C)NC(=O)[C@H](CCCNC(N)=N)NC(=O)[C@H](Cc1ccc4ccccc4c1)NC2=O)C(=O)N[C@@H](Cc1ccccc1)C(=O)N[C@@H](Cc1ccc2ccccc2c1)C(=O)N[C@@H](CCCNC(N)=N)C(=O)N[C@@H](CCCNC(N)=N)C(=O)N[C@@H](CCCNC(N)=N)C(=O)N[C@@H](CCCNC(N)=N)C(=O)N[C@@H](CNC3=O)C(=O)N[C@@H](CCCCN)C(O)=O)[C@H](C)O
InChI Key: InChIKey=KFHNNYVUTJMSFH-ZCUDWAKFSA-N
Data: 1 Kd
Activity Spreadsheet -- Enzyme Inhibition Constant Data from BindingDB
Found 1 hit for monomerid = 50095923
Trg + Lig
Ki
nM
ΔG°
kcal/mole
IC50
nM
Kd
nM
EC50/IC50
nM
koff
s-1
kon
M-1s-1
pHTemp
°C
Peptidyl-prolyl cis-trans isomerase NIMA-interacting 1
(Homo sapiens (Human))
BDBM50095923
(CHEMBL3590360)
Show SMILES [H][C@]12CCCCN1C(=O)[C@]([H])(NC(=O)[C@H](Cc1ccc(F)c(F)c1)NC(=O)[C@@H](Cc1ccccc1)NC(=O)c1cc3cc(c1)C(=O)NC[C@]([H])(NC(=O)[C@@H](C)NC(=O)[C@H](C)NC(=O)[C@H](CCCNC(N)=N)NC(=O)[C@H](Cc1ccc4ccccc4c1)NC2=O)C(=O)N[C@@H](Cc1ccccc1)C(=O)N[C@@H](Cc1ccc2ccccc2c1)C(=O)N[C@@H](CCCNC(N)=N)C(=O)N[C@@H](CCCNC(N)=N)C(=O)N[C@@H](CCCNC(N)=N)C(=O)N[C@@H](CCCNC(N)=N)C(=O)N[C@@H](CNC3=O)C(=O)N[C@@H](CCCCN)C(O)=O)[C@H](C)O
Show InChI InChI=1S/C15H23N5O5/c1-2-24-5-3-4-9-18-13(16)10-14(19-9)20(7-17-10)15-12(23)11(22)8(6-21)25-15/h7-8,11-12,15,21-23H,2-6H2,1H3,(H2,16,18,19)/t8-,11+,12+,15?/m1/s1
NCI pathway
Reactome pathway
n/an/an/a 41n/an/an/an/an/a
The Ohio State University
Curated by ChEMBL
Assay Description
Binding affinity to N-terminal MBP fused and Texas-red-labeled full-length human Pin1 S16A/Y23A mutant expressed in Escherichia coli assessed as incr...
J Med Chem 58: 6306-12 (2015)
Article DOI: 10.1021/acs.jmedchem.5b00411
BindingDB Entry DOI: 10.7270/Q2T72K6Z