null
SMILES: [H][C@]12CCCCN1C(=O)[C@]([H])(NC(=O)[C@@H](NC(=O)[C@H](Cc1cnc[nH]1)NC(=O)c1cc3cc(c1)C(=O)NC[C@]([H])(NC(=O)[C@@H](C)NC(=O)[C@H](C)NC(=O)[C@H](CCCNC(N)=N)NC(=O)[C@H](Cc1ccc4ccccc4c1)NC2=O)C(=O)N[C@@H](Cc1ccccc1)C(=O)N[C@@H](Cc1ccc2ccccc2c1)C(=O)N[C@@H](CCCNC(N)=N)C(=O)N[C@@H](CCCNC(N)=N)C(=O)N[C@@H](CCCNC(N)=N)C(=O)N[C@@H](CCCNC(N)=N)C(=O)N[C@@H](CNC3=O)C(=O)N[C@@H](CCCCN)C(O)=O)c1ccccc1)[C@H](C)O
InChI Key: InChIKey=SMRMUZBGCWSILN-NJQSDRHMSA-N
Activity Spreadsheet -- Enzyme Inhibition Constant Data from BindingDB
Found 1 hit for monomerid = 50095930
Trg + Lig
Ki
nM
ΔG°
kcal/mole
IC50
nM
Kd
nM
EC50/IC50
nM
koff
s-1
kon
M-1s-1
pHTemp
°C
Peptidyl-prolyl cis-trans isomerase NIMA-interacting 1
(Homo sapiens (Human))
BDBM50095930
(CHEMBL3590315)
Show SMILES [H][C@]12CCCCN1C(=O)[C@]([H])(NC(=O)[C@@H](NC(=O)[C@H](Cc1cnc[nH]1)NC(=O)c1cc3cc(c1)C(=O)NC[C@]([H])(NC(=O)[C@@H](C)NC(=O)[C@H](C)NC(=O)[C@H](CCCNC(N)=N)NC(=O)[C@H](Cc1ccc4ccccc4c1)NC2=O)C(=O)N[C@@H](Cc1ccccc1)C(=O)N[C@@H](Cc1ccc2ccccc2c1)C(=O)N[C@@H](CCCNC(N)=N)C(=O)N[C@@H](CCCNC(N)=N)C(=O)N[C@@H](CCCNC(N)=N)C(=O)N[C@@H](CCCNC(N)=N)C(=O)N[C@@H](CNC3=O)C(=O)N[C@@H](CCCCN)C(O)=O)c1ccccc1)[C@H](C)O
Show InChI InChI=1S/C15H21N5O5/c16-12-9-13(19-15(18-12)24-7-3-1-2-4-7)20(6-17-9)14-11(23)10(22)8(5-21)25-14/h6-8,10-11,14,21-23H,1-5H2,(H2,16,18,19)/t8-,10+,11+,14?/m1/s1
NCI pathway
Reactome pathway
n/an/an/a 14n/an/an/an/an/a
The Ohio State University
Curated by ChEMBL
Assay Description
Binding affinity to N-terminal MBP fused and Texas-red-labeled full-length human Pin1 S16A/Y23A mutant expressed in Escherichia coli assessed as incr...
J Med Chem 58: 6306-12 (2015)
Article DOI: 10.1021/acs.jmedchem.5b00411
BindingDB Entry DOI: 10.7270/Q2T72K6Z