BDBM50095932 CHEMBL3590369
SMILES: [H][C@]12CCCCN1C(=O)[C@@H](CCCC)NC(=O)[C@H](Cc1ccc(F)cc1)NC(=O)[C@@H](Cc1ccccc1)NC(=O)c1cc3cc(c1)C(=O)NC[C@]([H])(NC(=O)[C@@H](C)NC(=O)[C@H](C)NC(=O)[C@H](CCCNC(N)=N)NC(=O)[C@H](Cc1ccc4ccccc4c1)NC2=O)C(=O)N[C@@H](Cc1ccccc1)C(=O)N[C@@H](Cc1ccc2ccccc2c1)C(=O)N[C@@H](CCCNC(N)=N)C(=O)N[C@@H](CCCNC(N)=N)C(=O)N[C@@H](CCCNC(N)=N)C(=O)N[C@@H](CCCNC(N)=N)C(=O)N[C@@H](CNC3=O)C(=O)N[C@@H](CCCCN)C(O)=O
InChI Key: InChIKey=SJHKIDBYNDGBMX-LJEUNREKSA-N
Data: 1 Kd
Activity Spreadsheet -- Enzyme Inhibition Constant Data from BindingDB
Found 1 hit for monomerid = 50095932
Trg + Lig
Ki
nM
ΔG°
kcal/mole
IC50
nM
Kd
nM
EC50/IC50
nM
koff
s-1
kon
M-1s-1
pHTemp
°C
Peptidyl-prolyl cis-trans isomerase NIMA-interacting 1
(Homo sapiens (Human))
BDBM50095932
(CHEMBL3590369)
Show SMILES [H][C@]12CCCCN1C(=O)[C@@H](CCCC)NC(=O)[C@H](Cc1ccc(F)cc1)NC(=O)[C@@H](Cc1ccccc1)NC(=O)c1cc3cc(c1)C(=O)NC[C@]([H])(NC(=O)[C@@H](C)NC(=O)[C@H](C)NC(=O)[C@H](CCCNC(N)=N)NC(=O)[C@H](Cc1ccc4ccccc4c1)NC2=O)C(=O)N[C@@H](Cc1ccccc1)C(=O)N[C@@H](Cc1ccc2ccccc2c1)C(=O)N[C@@H](CCCNC(N)=N)C(=O)N[C@@H](CCCNC(N)=N)C(=O)N[C@@H](CCCNC(N)=N)C(=O)N[C@@H](CCCNC(N)=N)C(=O)N[C@@H](CNC3=O)C(=O)N[C@@H](CCCCN)C(O)=O
Show InChI InChI=1S/C21H22N6O5/c1-3-23-20(30)17-15(28)16(29)21(32-17)27-10-24-14-18(22)25-13(26-19(14)27)9-6-11-4-7-12(31-2)8-5-11/h4-5,7-8,10,15-17,21,28-29H,3H2,1-2H3,(H,23,30)(H2,22,25,26)/t15-,16+,17+,21?/m1/s1
NCI pathway
Reactome pathway
n/an/an/a 71n/an/an/an/an/a
The Ohio State University
Curated by ChEMBL
Assay Description
Binding affinity to N-terminal MBP fused and Texas-red-labeled full-length human Pin1 S16A/Y23A mutant expressed in Escherichia coli assessed as incr...
J Med Chem 58: 6306-12 (2015)
Article DOI: 10.1021/acs.jmedchem.5b00411
BindingDB Entry DOI: 10.7270/Q2T72K6Z