BDBM50095954 CHEMBL3593775
SMILES: NC(=O)c1cnc2[nH]ccc2c1NC1CCN(CC1)c1cnc(cn1)C#N
InChI Key: InChIKey=SWXXHYTUMIMRFO-IPLINKKNSA-N
Data: 4 IC50
Activity Spreadsheet -- Enzyme Inhibition Constant Data from BindingDB
Found 4 hits for monomerid = 50095954
Trg + Lig
Ki
nM
ΔG°
kcal/mole
IC50
nM
Kd
nM
EC50/IC50
nM
koff
s-1
kon
M-1s-1
pHTemp
°C
Potassium voltage-gated channel subfamily H member 2
(Homo sapiens (Human))
BDBM50095954
(CHEMBL3593775)
Show SMILES NC(=O)c1cnc2[nH]ccc2c1NC1CCN(CC1)c1cnc(cn1)C#N
Show InChI InChI=1S/C20H20N6O4/c1-2-22-19(29)16-14(27)15(28)20(30-16)26-10-23-13-17(21)24-12(25-18(13)26)9-8-11-6-4-3-5-7-11/h3-7,10,14-16,20,27-28H,2H2,1H3,(H,22,29)(H2,21,24,25)/t14-,15+,16+,20?/m1/s1
Reactome pathway
n/an/a>1.00E+5n/an/an/an/an/an/a
Astellas Pharma Inc.
Curated by ChEMBL
Assay Description
Inhibition of human ERG expressed in CHOK1 cells incubated for 10 mins by Rb efflux assay
Bioorg Med Chem 23: 4871-83 (2015)
Article DOI: 10.1016/j.bmc.2015.05.034
BindingDB Entry DOI: 10.7270/Q2DZ0B21
Tyrosine-protein kinase JAK3
(Homo sapiens (Human))
BDBM50095954
(CHEMBL3593775)
Show SMILES NC(=O)c1cnc2[nH]ccc2c1NC1CCN(CC1)c1cnc(cn1)C#N
Show InChI InChI=1S/C20H20N6O4/c1-2-22-19(29)16-14(27)15(28)20(30-16)26-10-23-13-17(21)24-12(25-18(13)26)9-8-11-6-4-3-5-7-11/h3-7,10,14-16,20,27-28H,2H2,1H3,(H,22,29)(H2,21,24,25)/t14-,15+,16+,20?/m1/s1
Reactome pathway
n/an/a 3.60n/an/an/an/an/an/a
Astellas Pharma Inc.
Curated by ChEMBL
Assay Description
Inhibition of human JAK3 kinase domain using biotin-Lyn-substrate-2 as substrate incubated for 1 hr by ELISA method
Bioorg Med Chem 23: 4871-83 (2015)
Article DOI: 10.1016/j.bmc.2015.05.034
BindingDB Entry DOI: 10.7270/Q2DZ0B21
Tyrosine-protein kinase JAK1
(Homo sapiens (Human))
BDBM50095954
(CHEMBL3593775)
Show SMILES NC(=O)c1cnc2[nH]ccc2c1NC1CCN(CC1)c1cnc(cn1)C#N
Show InChI InChI=1S/C20H20N6O4/c1-2-22-19(29)16-14(27)15(28)20(30-16)26-10-23-13-17(21)24-12(25-18(13)26)9-8-11-6-4-3-5-7-11/h3-7,10,14-16,20,27-28H,2H2,1H3,(H,22,29)(H2,21,24,25)/t14-,15+,16+,20?/m1/s1
Reactome pathway
n/an/a 35n/an/an/an/an/an/a
Astellas Pharma Inc.
Curated by ChEMBL
Assay Description
Inhibition of human JAK1 kinase domain using biotin-Lyn-substrate-2 as substrate incubated for 1 hr by ELISA method
Bioorg Med Chem 23: 4871-83 (2015)
Article DOI: 10.1016/j.bmc.2015.05.034
BindingDB Entry DOI: 10.7270/Q2DZ0B21
Tyrosine-protein kinase JAK2
(Homo sapiens (Human))
BDBM50095954
(CHEMBL3593775)
Show SMILES NC(=O)c1cnc2[nH]ccc2c1NC1CCN(CC1)c1cnc(cn1)C#N
Show InChI InChI=1S/C20H20N6O4/c1-2-22-19(29)16-14(27)15(28)20(30-16)26-10-23-13-17(21)24-12(25-18(13)26)9-8-11-6-4-3-5-7-11/h3-7,10,14-16,20,27-28H,2H2,1H3,(H,22,29)(H2,21,24,25)/t14-,15+,16+,20?/m1/s1
Reactome pathway
n/an/a 41n/an/an/an/an/an/a
Astellas Pharma Inc.
Curated by ChEMBL
Assay Description
Inhibition of human JAK2 kinase domain using biotin-Lyn-substrate-2 as substrate incubated for 1 hr by ELISA method
Bioorg Med Chem 23: 4871-83 (2015)
Article DOI: 10.1016/j.bmc.2015.05.034
BindingDB Entry DOI: 10.7270/Q2DZ0B21