null
SMILES: NC(=O)c1cnc2[nH]ccc2c1NC1CCN(CC1)c1ccc(CO)cn1
InChI Key: InChIKey=DMSPOLNMPCSGKG-YNCIEYEPSA-N
Activity Spreadsheet -- Enzyme Inhibition Constant Data from BindingDB
Found 3 hits for monomerid = 50095956
Trg + Lig
Ki
nM
ΔG°
kcal/mole
IC50
nM
Kd
nM
EC50/IC50
nM
koff
s-1
kon
M-1s-1
pHTemp
°C
Tyrosine-protein kinase JAK2
(Homo sapiens (Human))
BDBM50095956
(CHEMBL3593774)
Show SMILES NC(=O)c1cnc2[nH]ccc2c1NC1CCN(CC1)c1ccc(CO)cn1
Show InChI InChI=1S/C20H21N5O4/c21-18-15-19(25(11-22-15)20-17(28)16(27)13(10-26)29-20)24-14(23-18)9-5-4-8-12-6-2-1-3-7-12/h1-3,6-7,11,13,16-17,20,26-28H,4,8,10H2,(H2,21,23,24)/t13-,16+,17+,20?/m1/s1
Reactome pathway
n/an/a 100n/an/an/an/an/an/a
Astellas Pharma Inc.
Curated by ChEMBL
Assay Description
Inhibition of human JAK2 kinase domain using biotin-Lyn-substrate-2 as substrate incubated for 1 hr by ELISA method
Bioorg Med Chem 23: 4871-83 (2015)
Article DOI: 10.1016/j.bmc.2015.05.034
BindingDB Entry DOI: 10.7270/Q2DZ0B21
Tyrosine-protein kinase JAK3
(Homo sapiens (Human))
BDBM50095956
(CHEMBL3593774)
Show SMILES NC(=O)c1cnc2[nH]ccc2c1NC1CCN(CC1)c1ccc(CO)cn1
Show InChI InChI=1S/C20H21N5O4/c21-18-15-19(25(11-22-15)20-17(28)16(27)13(10-26)29-20)24-14(23-18)9-5-4-8-12-6-2-1-3-7-12/h1-3,6-7,11,13,16-17,20,26-28H,4,8,10H2,(H2,21,23,24)/t13-,16+,17+,20?/m1/s1
Reactome pathway
n/an/a 9.20n/an/an/an/an/an/a
Astellas Pharma Inc.
Curated by ChEMBL
Assay Description
Inhibition of human JAK3 kinase domain using biotin-Lyn-substrate-2 as substrate incubated for 1 hr by ELISA method
Bioorg Med Chem 23: 4871-83 (2015)
Article DOI: 10.1016/j.bmc.2015.05.034
BindingDB Entry DOI: 10.7270/Q2DZ0B21
Tyrosine-protein kinase JAK1
(Homo sapiens (Human))
BDBM50095956
(CHEMBL3593774)
Show SMILES NC(=O)c1cnc2[nH]ccc2c1NC1CCN(CC1)c1ccc(CO)cn1
Show InChI InChI=1S/C20H21N5O4/c21-18-15-19(25(11-22-15)20-17(28)16(27)13(10-26)29-20)24-14(23-18)9-5-4-8-12-6-2-1-3-7-12/h1-3,6-7,11,13,16-17,20,26-28H,4,8,10H2,(H2,21,23,24)/t13-,16+,17+,20?/m1/s1
Reactome pathway
n/an/a 180n/an/an/an/an/an/a
Astellas Pharma Inc.
Curated by ChEMBL
Assay Description
Inhibition of human JAK1 kinase domain using biotin-Lyn-substrate-2 as substrate incubated for 1 hr by ELISA method
Bioorg Med Chem 23: 4871-83 (2015)
Article DOI: 10.1016/j.bmc.2015.05.034
BindingDB Entry DOI: 10.7270/Q2DZ0B21