BDBM50096281 CHEMBL3585460
SMILES: Cc1cc2c(cnc(NC3CCNCC3)c2[nH]c1=O)-c1cncc(NS(C)(=O)=O)c1
InChI Key: InChIKey=JRLLESZXDXKGDL-UHFFFAOYSA-N
Data: 2 IC50
Activity Spreadsheet -- Enzyme Inhibition Constant Data from BindingDB
Found 2 hits for monomerid = 50096281
Trg + Lig
Ki
nM
ΔG°
kcal/mole
IC50
nM
Kd
nM
EC50/IC50
nM
koff
s-1
kon
M-1s-1
pHTemp
°C
Bromodomain-containing protein 4
(Homo sapiens (Human))
BDBM50096281
(CHEMBL3585460)
Show SMILES Cc1cc2c(cnc(NC3CCNCC3)c2[nH]c1=O)-c1cncc(NS(C)(=O)=O)c1
Show InChI InChI=1S/C22H16N4O6S/c27-18(25-33(31,32)13-6-2-1-3-7-13)9-12-5-4-8-14-15(12)10-17-19(14)24-21(28)20-23-16(22(29)30)11-26(17)20/h1-8,11H,9-10H2,(H,24,28)(H,25,27)(H,29,30)
n/an/a 794n/an/an/an/an/an/a
GlaxoSmithKline
Curated by ChEMBL
Assay Description
Displacement of I-BET762 from 6His-Thr-BRD4 (1 to 477) BD1 (unknown origin) harboring BD2 Y390A mutant after 30 mins by TR-FRET analysis
J Med Chem 58: 5649-73 (2015)
Article DOI: 10.1021/acs.jmedchem.5b00772
BindingDB Entry DOI: 10.7270/Q2PR7XQN
ATPase family AAA domain-containing protein 2
(Homo sapiens (Human))
BDBM50096281
(CHEMBL3585460)
Show SMILES Cc1cc2c(cnc(NC3CCNCC3)c2[nH]c1=O)-c1cncc(NS(C)(=O)=O)c1
Show InChI InChI=1S/C22H16N4O6S/c27-18(25-33(31,32)13-6-2-1-3-7-13)9-12-5-4-8-14-15(12)10-17-19(14)24-21(28)20-23-16(22(29)30)11-26(17)20/h1-8,11H,9-10H2,(H,24,28)(H,25,27)(H,29,30)
n/an/a 1.26E+3n/an/an/an/an/an/a
GlaxoSmithKline
Curated by ChEMBL
Assay Description
Displacement of histone H4 peptide from FLAG-6His-Tev-ATAD2 (981 to 1121) (unknown origin) expressed in Escherichia coli BL21 (DE3) after 30 mins by ...
J Med Chem 58: 5649-73 (2015)
Article DOI: 10.1021/acs.jmedchem.5b00772
BindingDB Entry DOI: 10.7270/Q2PR7XQN