BDBM50096314 CHEMBL3586722
SMILES: Cc1cc2c(cnc(NC3CCNCC3)c2[nH]c1=O)-c1cccc2[nH]ncc12
InChI Key: InChIKey=MPIJUEYGBAZBPF-ZRDIBKRKSA-N
Data: 2 IC50
Activity Spreadsheet -- Enzyme Inhibition Constant Data from BindingDB
Found 2 hits for monomerid = 50096314
Trg + Lig
Ki
nM
ΔG°
kcal/mole
IC50
nM
Kd
nM
EC50/IC50
nM
koff
s-1
kon
M-1s-1
pHTemp
°C
ATPase family AAA domain-containing protein 2
(Homo sapiens (Human))
BDBM50096314
(CHEMBL3586722)
Show SMILES Cc1cc2c(cnc(NC3CCNCC3)c2[nH]c1=O)-c1cccc2[nH]ncc12
Show InChI InChI=1S/C23H15ClFN3O3/c1-31-23(30)19-7-4-5-15(26-19)10-12-21-27-18-11-9-14(25)13-16(18)22(29)28(21)20-8-3-2-6-17(20)24/h2-13H,1H3/b12-10+
n/an/a 1.26E+3n/an/an/an/an/an/a
GlaxoSmithKline
Curated by ChEMBL
Assay Description
Displacement of histone H4 peptide from FLAG-6His-Tev-ATAD2 (981 to 1121) (unknown origin) expressed in Escherichia coli BL21 (DE3) after 30 mins by ...
J Med Chem 58: 5649-73 (2015)
Article DOI: 10.1021/acs.jmedchem.5b00772
BindingDB Entry DOI: 10.7270/Q2PR7XQN
Bromodomain-containing protein 4
(Homo sapiens (Human))
BDBM50096314
(CHEMBL3586722)
Show SMILES Cc1cc2c(cnc(NC3CCNCC3)c2[nH]c1=O)-c1cccc2[nH]ncc12
Show InChI InChI=1S/C23H15ClFN3O3/c1-31-23(30)19-7-4-5-15(26-19)10-12-21-27-18-11-9-14(25)13-16(18)22(29)28(21)20-8-3-2-6-17(20)24/h2-13H,1H3/b12-10+
n/an/a 126n/an/an/an/an/an/a
GlaxoSmithKline
Curated by ChEMBL
Assay Description
Displacement of I-BET762 from 6His-Thr-BRD4 (1 to 477) BD1 (unknown origin) harboring BD2 Y390A mutant after 30 mins by TR-FRET analysis
J Med Chem 58: 5649-73 (2015)
Article DOI: 10.1021/acs.jmedchem.5b00772
BindingDB Entry DOI: 10.7270/Q2PR7XQN