BDBM50096608 CHEMBL3577288
SMILES: CC(C)C[C@H](NC(=O)Cn1c2C[C@@H](CCc2c2cc(Br)ccc12)C(O)=O)C(O)=O
InChI Key: InChIKey=XUXZKDWGLJYXFH-WBMJQRKESA-N
Data: 1 KI  1 IC50
Activity Spreadsheet -- Enzyme Inhibition Constant Data from BindingDB
Found 2 hits for monomerid = 50096608
Trg + Lig
Ki
nM
ΔG°
kcal/mole
IC50
nM
Kd
nM
EC50/IC50
nM
koff
s-1
kon
M-1s-1
pHTemp
°C
DNA polymerase III subunit beta
(Escherichia coli (strain K12))
BDBM50096608
(CHEMBL3577288)
Show SMILES CC(C)C[C@H](NC(=O)Cn1c2C[C@@H](CCc2c2cc(Br)ccc12)C(O)=O)C(O)=O |r|
Show InChI InChI=1S/C21H25BrN2O5/c1-11(2)7-16(21(28)29)23-19(25)10-24-17-6-4-13(22)9-15(17)14-5-3-12(20(26)27)8-18(14)24/h4,6,9,11-12,16H,3,5,7-8,10H2,1-2H3,(H,23,25)(H,26,27)(H,28,29)/t12-,16+/m1/s1
2.70E+4n/an/an/an/an/an/an/an/a
The University of Wollongong and The Illawarra Health and Medical Research Institute
Curated by ChEMBL
Assay Description
Inhibition of Escherichia coli DNA sliding clamp protein using N-fluorescein (FAM)-QLDLF-OH tracer by fluorescence polarization assay
J Med Chem 58: 4693-702 (2015)
Article DOI: 10.1021/acs.jmedchem.5b00232
BindingDB Entry DOI: 10.7270/Q2KK9DJ9
DNA polymerase III subunit beta
(Escherichia coli (strain K12))
BDBM50096608
(CHEMBL3577288)
Show SMILES CC(C)C[C@H](NC(=O)Cn1c2C[C@@H](CCc2c2cc(Br)ccc12)C(O)=O)C(O)=O |r|
Show InChI InChI=1S/C21H25BrN2O5/c1-11(2)7-16(21(28)29)23-19(25)10-24-17-6-4-13(22)9-15(17)14-5-3-12(20(26)27)8-18(14)24/h4,6,9,11-12,16H,3,5,7-8,10H2,1-2H3,(H,23,25)(H,26,27)(H,28,29)/t12-,16+/m1/s1
n/an/a 4.80E+4n/an/an/an/an/an/a
The University of Wollongong and The Illawarra Health and Medical Research Institute
Curated by ChEMBL
Assay Description
Inhibition of Escherichia coli DNA sliding clamp protein using N-fluorescein (FAM)-QLDLF-OH tracer by fluorescence polarization assay
J Med Chem 58: 4693-702 (2015)
Article DOI: 10.1021/acs.jmedchem.5b00232
BindingDB Entry DOI: 10.7270/Q2KK9DJ9