BDBM50096617 CHEMBL3577277
SMILES: NC(=O)Cn1c2C[C@H](CCc2c2cc(Br)ccc12)C(O)=O
InChI Key: InChIKey=IALVQODOZJMHOS-QMMMGPOBSA-N
Data: 1 KI  1 IC50
Activity Spreadsheet -- Enzyme Inhibition Constant Data from BindingDB
Found 2 hits for monomerid = 50096617
Trg + Lig
Ki
nM
ΔG°
kcal/mole
IC50
nM
Kd
nM
EC50/IC50
nM
koff
s-1
kon
M-1s-1
pHTemp
°C
DNA polymerase III subunit beta
(Escherichia coli (strain K12))
BDBM50096617
(CHEMBL3577277)
Show SMILES NC(=O)Cn1c2C[C@H](CCc2c2cc(Br)ccc12)C(O)=O |r|
Show InChI InChI=1S/C15H15BrN2O3/c16-9-2-4-12-11(6-9)10-3-1-8(15(20)21)5-13(10)18(12)7-14(17)19/h2,4,6,8H,1,3,5,7H2,(H2,17,19)(H,20,21)/t8-/m0/s1
1.58E+5n/an/an/an/an/an/an/an/a
The University of Wollongong and The Illawarra Health and Medical Research Institute
Curated by ChEMBL
Assay Description
Inhibition of Escherichia coli DNA sliding clamp protein using N-fluorescein (FAM)-QLDLF-OH tracer by fluorescence polarization assay
J Med Chem 58: 4693-702 (2015)
Article DOI: 10.1021/acs.jmedchem.5b00232
BindingDB Entry DOI: 10.7270/Q2KK9DJ9
DNA polymerase III subunit beta
(Escherichia coli (strain K12))
BDBM50096617
(CHEMBL3577277)
Show SMILES NC(=O)Cn1c2C[C@H](CCc2c2cc(Br)ccc12)C(O)=O |r|
Show InChI InChI=1S/C15H15BrN2O3/c16-9-2-4-12-11(6-9)10-3-1-8(15(20)21)5-13(10)18(12)7-14(17)19/h2,4,6,8H,1,3,5,7H2,(H2,17,19)(H,20,21)/t8-/m0/s1
n/an/a 2.85E+5n/an/an/an/an/an/a
The University of Wollongong and The Illawarra Health and Medical Research Institute
Curated by ChEMBL
Assay Description
Inhibition of Escherichia coli DNA sliding clamp protein using N-fluorescein (FAM)-QLDLF-OH tracer by fluorescence polarization assay
J Med Chem 58: 4693-702 (2015)
Article DOI: 10.1021/acs.jmedchem.5b00232
BindingDB Entry DOI: 10.7270/Q2KK9DJ9