BDBM50096640 CHEMBL3577266
SMILES: COC(=O)C1CCc2c(C1)[nH]c1ccc(Cl)cc21
InChI Key:
Data: 1 IC50
Activity Spreadsheet -- Enzyme Inhibition Constant Data from BindingDB
Found 1 hit for monomerid = 50096640
Trg + Lig
Ki
nM
ΔG°
kcal/mole
IC50
nM
Kd
nM
EC50/IC50
nM
koff
s-1
kon
M-1s-1
pHTemp
°C
DNA polymerase III subunit beta
(Escherichia coli (strain K12))
BDBM50096640
(CHEMBL3577266)
Show SMILES COC(=O)C1CCc2c(C1)[nH]c1ccc(Cl)cc21
n/an/a>1.00E+6n/an/an/an/an/an/a
The University of Wollongong and The Illawarra Health and Medical Research Institute
Curated by ChEMBL
Assay Description
Inhibition of Escherichia coli DNA sliding clamp protein using N-fluorescein (FAM)-QLDLF-OH tracer by fluorescence polarization assay
J Med Chem 58: 4693-702 (2015)
Article DOI: 10.1021/acs.jmedchem.5b00232
BindingDB Entry DOI: 10.7270/Q2KK9DJ9