null
SMILES: FC(F)(F)C(OCc1ccccc1)(\C=C\c1ccccc1)c1ccc[nH]c1=O
InChI Key: InChIKey=SRJQGWRGTNXGQP-BUHFOSPRSA-N
Activity Spreadsheet -- Enzyme Inhibition Constant Data from BindingDB
Found 1 hit for monomerid = 50096673
Trg + Lig
Ki
nM
ΔG°
kcal/mole
IC50
nM
Kd
nM
EC50/IC50
nM
koff
s-1
kon
M-1s-1
pHTemp
°C
Reverse transcriptase/RNaseH
(Human immunodeficiency virus 1)
BDBM50096673
(3-((E)-1-Benzyloxy-3-phenyl-1-trifluoromethyl-ally...)
Show SMILES FC(F)(F)C(OCc1ccccc1)(\C=C\c1ccccc1)c1ccc[nH]c1=O
Show InChI InChI=1S/C22H18F3NO2/c23-22(24,25)21(19-12-7-15-26-20(19)27,14-13-17-8-3-1-4-9-17)28-16-18-10-5-2-6-11-18/h1-15H,16H2,(H,26,27)/b14-13+
n/an/a 44n/an/an/an/an/an/a
DuPont Pharmaceuticals Company
Curated by ChEMBL
Assay Description
Inhibition of the NNRTI HIV-1 enzyme by 50% using enzyme assay.
Bioorg Med Chem Lett 11: 309-12 (2001)
BindingDB Entry DOI: 10.7270/Q23T9HSR