BDBM50096884 (9Z,12Z,15Z)-Octadeca-9,12,15-trienoic acid [2-(3,4-dihydroxy-phenyl)-ethyl]-amide::CHEMBL138040::Linoleoyl dopamine
SMILES: CC\C=C/C\C=C/C\C=C/CCCCCCCC(=O)NCCc1ccc(O)c(O)c1
InChI Key: InChIKey=WKASWGQDAKPOAS-PDBXOOCHSA-N
Data: 1 KI
Activity Spreadsheet -- Enzyme Inhibition Constant Data from BindingDB
Found 1 hit for monomerid = 50096884
Trg + Lig
Ki
nM
ΔG°
kcal/mole
IC50
nM
Kd
nM
EC50/IC50
nM
koff
s-1
kon
M-1s-1
pHTemp
°C
Cannabinoid receptor 1
(Rattus norvegicus (rat))
BDBM50096884
((9Z,12Z,15Z)-Octadeca-9,12,15-trienoic acid [2-(3,...)
Show SMILES CC\C=C/C\C=C/C\C=C/CCCCCCCC(=O)NCCc1ccc(O)c(O)c1
Show InChI InChI=1S/C26H39NO3/c1-2-3-4-5-6-7-8-9-10-11-12-13-14-15-16-17-26(30)27-21-20-23-18-19-24(28)25(29)22-23/h3-4,6-7,9-10,18-19,22,28-29H,2,5,8,11-17,20-21H2,1H3,(H,27,30)/b4-3-,7-6-,10-9-
Reactome pathway
3.13E+3n/an/an/an/an/an/an/an/a
Institute of Bioorganic Chemistry RAS
Curated by ChEMBL
Assay Description
Concentration required to displace 0.4 nM [3H]-SR-141,716A from CB1 receptor in rat brain preparations in the presence of 0.1 mM phenylmethyl sulphon...
Bioorg Med Chem Lett 11: 447-9 (2001)
BindingDB Entry DOI: 10.7270/Q2VT1RBM