null
SMILES: [H][C@@]1(CCc2cc(F)c(F)cc12)[C@@H](N)CC(=O)N1Cc2ccc(F)cc2N(C)C(=O)C1
InChI Key: InChIKey=GWDULQIZASXREQ-KXBFYZLASA-N
Activity Spreadsheet -- Enzyme Inhibition Constant Data from BindingDB
Found 3 hits for monomerid = 50096890
Trg + Lig
Ki
nM
ΔG°
kcal/mole
IC50
nM
Kd
nM
EC50/IC50
nM
koff
s-1
kon
M-1s-1
pHTemp
°C
Dipeptidyl peptidase 4
(Homo sapiens (Human))
BDBM50096890
(CHEMBL3580789)
Show SMILES [H][C@@]1(CCc2cc(F)c(F)cc12)[C@@H](N)CC(=O)N1Cc2ccc(F)cc2N(C)C(=O)C1 |r|
Show InChI InChI=1S/C22H22F3N3O2/c1-27-20-7-14(23)4-2-13(20)10-28(11-22(27)30)21(29)9-19(26)15-5-3-12-6-17(24)18(25)8-16(12)15/h2,4,6-8,15,19H,3,5,9-11,26H2,1H3/t15-,19-/m0/s1
Reactome pathway
n/an/a 3.40n/an/an/an/an/an/a
Chinese Academy of Sciences
Curated by ChEMBL
Assay Description
Inhibition of DPP4 extracted from human Caco2 cells using H-Gly-Pro-AMC substrate after 10 mins by fluorescence assay
ACS Med Chem Lett 6: 602-6 (2015)
Article DOI: 10.1021/acsmedchemlett.5b00074
BindingDB Entry DOI: 10.7270/Q22J6DM2
Dipeptidyl peptidase 9
(Homo sapiens (Human))
BDBM50096890
(CHEMBL3580789)
Show SMILES [H][C@@]1(CCc2cc(F)c(F)cc12)[C@@H](N)CC(=O)N1Cc2ccc(F)cc2N(C)C(=O)C1 |r|
Show InChI InChI=1S/C22H22F3N3O2/c1-27-20-7-14(23)4-2-13(20)10-28(11-22(27)30)21(29)9-19(26)15-5-3-12-6-17(24)18(25)8-16(12)15/h2,4,6-8,15,19H,3,5,9-11,26H2,1H3/t15-,19-/m0/s1
n/an/a>1.00E+4n/an/an/an/an/an/a
Chinese Academy of Sciences
Curated by ChEMBL
Assay Description
Inhibition of human recombinant DPP9 using H-Gly-Pro-AMC substrate after 10 mins by fluorescence assay
ACS Med Chem Lett 6: 602-6 (2015)
Article DOI: 10.1021/acsmedchemlett.5b00074
BindingDB Entry DOI: 10.7270/Q22J6DM2
Dipeptidyl peptidase 8
(Homo sapiens (Human))
BDBM50096890
(CHEMBL3580789)
Show SMILES [H][C@@]1(CCc2cc(F)c(F)cc12)[C@@H](N)CC(=O)N1Cc2ccc(F)cc2N(C)C(=O)C1 |r|
Show InChI InChI=1S/C22H22F3N3O2/c1-27-20-7-14(23)4-2-13(20)10-28(11-22(27)30)21(29)9-19(26)15-5-3-12-6-17(24)18(25)8-16(12)15/h2,4,6-8,15,19H,3,5,9-11,26H2,1H3/t15-,19-/m0/s1
n/an/a>1.00E+4n/an/an/an/an/an/a
Chinese Academy of Sciences
Curated by ChEMBL
Assay Description
Inhibition of human recombinant DPP8 using H-Gly-Pro-AMC substrate after 10 mins by fluorescence assay
ACS Med Chem Lett 6: 602-6 (2015)
Article DOI: 10.1021/acsmedchemlett.5b00074
BindingDB Entry DOI: 10.7270/Q22J6DM2