null
SMILES: CCC(NC(=S)Nc1nccs1)c1ccccc1
InChI Key: InChIKey=PBDIRHCFDNJKQO-UHFFFAOYSA-N
Activity Spreadsheet -- Enzyme Inhibition Constant Data from BindingDB
Found 2 hits for monomerid = 50097039
Trg + Lig
Ki
nM
ΔG°
kcal/mole
IC50
nM
Kd
nM
EC50/IC50
nM
koff
s-1
kon
M-1s-1
pHTemp
°C
Reverse transcriptase/RNaseH
(Human immunodeficiency virus 1)
BDBM50097039
(1-(1-Phenyl-propyl)-3-thiazol-2-yl-thiourea | CHEM...)
Show SMILES CCC(NC(=S)Nc1nccs1)c1ccccc1
Show InChI InChI=1S/C13H15N3S2/c1-2-11(10-6-4-3-5-7-10)15-12(17)16-13-14-8-9-18-13/h3-9,11H,2H2,1H3,(H2,14,15,16,17)
n/an/a 1.50E+3n/an/an/an/an/an/a
Institute
Curated by ChEMBL
Assay Description
Inhibitory activity against non-nucleoside reverse transcriptase inhibitors (NNRTI) -resistant HIV-1 strain A17 variant with Y181C plus K103N mutatio...
Bioorg Med Chem Lett 11: 523-8 (2001)
BindingDB Entry DOI: 10.7270/Q237780X
Reverse transcriptase/RNaseH
(Human immunodeficiency virus 1)
BDBM50097039
(1-(1-Phenyl-propyl)-3-thiazol-2-yl-thiourea | CHEM...)
Show SMILES CCC(NC(=S)Nc1nccs1)c1ccccc1
Show InChI InChI=1S/C13H15N3S2/c1-2-11(10-6-4-3-5-7-10)15-12(17)16-13-14-8-9-18-13/h3-9,11H,2H2,1H3,(H2,14,15,16,17)
n/an/a 2.10E+3n/an/an/an/an/an/a
Institute
Curated by ChEMBL
Assay Description
Binding affinity towards 5-hydroxytryptamine 3 receptor
Bioorg Med Chem Lett 11: 523-8 (2001)
BindingDB Entry DOI: 10.7270/Q237780X