BDBM50097083 2-(3,4-Dichloro-phenyl)-quinoline-4-carboxylic acid::CHEMBL150249
SMILES: OC(=O)c1cc(nc2ccccc12)-c1ccc(Cl)c(Cl)c1
InChI Key: InChIKey=METUEFNOMUIMQR-UHFFFAOYSA-N
Data: 2 IC50
Activity Spreadsheet -- Enzyme Inhibition Constant Data from BindingDB
Found 2 hits for monomerid = 50097083
Trg + Lig
Ki
nM
ΔG°
kcal/mole
IC50
nM
Kd
nM
EC50/IC50
nM
koff
s-1
kon
M-1s-1
pHTemp
°C
Prolyl-tRNA synthetase
(Candida albicans)
BDBM50097083
(2-(3,4-Dichloro-phenyl)-quinoline-4-carboxylic aci...)
Show SMILES OC(=O)c1cc(nc2ccccc12)-c1ccc(Cl)c(Cl)c1
Show InChI InChI=1S/C16H9Cl2NO2/c17-12-6-5-9(7-13(12)18)15-8-11(16(20)21)10-3-1-2-4-14(10)19-15/h1-8H,(H,20,21)
n/an/a 1.90E+4n/an/an/an/an/an/a
Cubist Pharmaceuticals, Inc.
Curated by ChEMBL
Assay Description
Aminoacylation activity against Candida albicans prolyl-tRNA synthetase
Bioorg Med Chem Lett 11: 541-4 (2001)
BindingDB Entry DOI: 10.7270/Q2Q23ZH8
Aminoacyl-tRNA synthetase
(Homo sapiens (Human))
BDBM50097083
(2-(3,4-Dichloro-phenyl)-quinoline-4-carboxylic aci...)
Show SMILES OC(=O)c1cc(nc2ccccc12)-c1ccc(Cl)c(Cl)c1
Show InChI InChI=1S/C16H9Cl2NO2/c17-12-6-5-9(7-13(12)18)15-8-11(16(20)21)10-3-1-2-4-14(10)19-15/h1-8H,(H,20,21)
Reactome pathway
n/an/a>1.00E+5n/an/an/an/an/an/a
Cubist Pharmaceuticals, Inc.
Curated by ChEMBL
Assay Description
Aminoacylation activity against human prolyl-tRNA synthetase
Bioorg Med Chem Lett 11: 541-4 (2001)
BindingDB Entry DOI: 10.7270/Q2Q23ZH8