BDBM50097326 (2-Chloro-phenyl)-phosphonic acid mono-(11-{2-[1-(3-pyrrol-1-yl-propyl)-1H-indol-3-yl]-acetylamino}-undecyl) ester::CHEMBL349085
SMILES: OP(=O)(OCCCCCCCCCCCNC(=O)Cc1cn(CCCn2cccc2)c2ccccc12)c1ccccc1Cl
InChI Key: InChIKey=IXPYZYYBMRMWCK-UHFFFAOYSA-N
Data: 1 IC50
Activity Spreadsheet -- Enzyme Inhibition Constant Data from BindingDB
Found 1 hit for monomerid = 50097326
Trg + Lig
Ki
nM
ΔG°
kcal/mole
IC50
nM
Kd
nM
EC50/IC50
nM
koff
s-1
kon
M-1s-1
pHTemp
°C
Telomerase reverse transcriptase
(Homo sapiens (Human))
BDBM50097326
((2-Chloro-phenyl)-phosphonic acid mono-(11-{2-[1-(...)
Show SMILES OP(=O)(OCCCCCCCCCCCNC(=O)Cc1cn(CCCn2cccc2)c2ccccc12)c1ccccc1Cl
Show InChI InChI=1S/C34H45ClN3O4P/c35-31-18-9-11-20-33(31)43(40,41)42-26-15-7-5-3-1-2-4-6-12-21-36-34(39)27-29-28-38(32-19-10-8-17-30(29)32)25-16-24-37-22-13-14-23-37/h8-11,13-14,17-20,22-23,28H,1-7,12,15-16,21,24-27H2,(H,36,39)(H,40,41)
NCI pathway
Reactome pathway
n/an/a 4.20E+3n/an/an/an/an/an/a
Kyushu University
Curated by ChEMBL
Assay Description
Inhibitory concentration against human telomerase
Bioorg Med Chem Lett 11: 583-5 (2001)
BindingDB Entry DOI: 10.7270/Q2XK8DV2