BDBM50097392 CHEMBL3586441
SMILES: [H][C@@]12CN(C[C@]1([H])CN(C2)c1nc(C)cc(C)n1)C(=O)c1cc(OC)ccc1-n1nccn1
InChI Key: InChIKey=JEGXPQYWMVONEI-CALCHBBNSA-N
Data: 3 KI  1 IC50
Activity Spreadsheet -- Enzyme Inhibition Constant Data from BindingDB
Found 4 hits for monomerid = 50097392
Trg + Lig
Ki
nM
ΔG°
kcal/mole
IC50
nM
Kd
nM
EC50/IC50
nM
koff
s-1
kon
M-1s-1
pHTemp
°C
Orexin receptor 2
(Rattus norvegicus (Rat))
BDBM50097392
(CHEMBL3586441)
Show SMILES [H][C@@]12CN(C[C@]1([H])CN(C2)c1nc(C)cc(C)n1)C(=O)c1cc(OC)ccc1-n1nccn1 |r|
Show InChI InChI=1S/C22H25N7O2/c1-14-8-15(2)26-22(25-14)28-12-16-10-27(11-17(16)13-28)21(30)19-9-18(31-3)4-5-20(19)29-23-6-7-24-29/h4-9,16-17H,10-13H2,1-3H3/t16-,17+
Reactome pathway
38n/an/an/an/an/an/an/an/a
TBA
Curated by ChEMBL
Assay Description
Binding affinity to rat OX2 receptor
J Med Chem 58: 5620-36 (2015)
Article DOI: 10.1021/acs.jmedchem.5b00742
BindingDB Entry DOI: 10.7270/Q2QR4ZWG
Orexin receptor type 2
(Homo sapiens (Human))
BDBM50097392
(CHEMBL3586441)
Show SMILES [H][C@@]12CN(C[C@]1([H])CN(C2)c1nc(C)cc(C)n1)C(=O)c1cc(OC)ccc1-n1nccn1 |r|
Show InChI InChI=1S/C22H25N7O2/c1-14-8-15(2)26-22(25-14)28-12-16-10-27(11-17(16)13-28)21(30)19-9-18(31-3)4-5-20(19)29-23-6-7-24-29/h4-9,16-17H,10-13H2,1-3H3/t16-,17+
Reactome pathway
46n/an/an/an/an/an/an/an/a
TBA
Curated by ChEMBL
Assay Description
Binding affinity to human OX2 receptor
J Med Chem 58: 5620-36 (2015)
Article DOI: 10.1021/acs.jmedchem.5b00742
BindingDB Entry DOI: 10.7270/Q2QR4ZWG
Orexin receptor type 1
(Homo sapiens (Human))
BDBM50097392
(CHEMBL3586441)
Show SMILES [H][C@@]12CN(C[C@]1([H])CN(C2)c1nc(C)cc(C)n1)C(=O)c1cc(OC)ccc1-n1nccn1 |r|
Show InChI InChI=1S/C22H25N7O2/c1-14-8-15(2)26-22(25-14)28-12-16-10-27(11-17(16)13-28)21(30)19-9-18(31-3)4-5-20(19)29-23-6-7-24-29/h4-9,16-17H,10-13H2,1-3H3/t16-,17+
Reactome pathway
5.75E+3n/an/an/an/an/an/an/an/a
TBA
Curated by ChEMBL
Assay Description
Binding affinity to human OX1 receptor
J Med Chem 58: 5620-36 (2015)
Article DOI: 10.1021/acs.jmedchem.5b00742
BindingDB Entry DOI: 10.7270/Q2QR4ZWG
Potassium voltage-gated channel subfamily H member 2
(Homo sapiens (Human))
BDBM50097392
(CHEMBL3586441)
Show SMILES [H][C@@]12CN(C[C@]1([H])CN(C2)c1nc(C)cc(C)n1)C(=O)c1cc(OC)ccc1-n1nccn1 |r|
Show InChI InChI=1S/C22H25N7O2/c1-14-8-15(2)26-22(25-14)28-12-16-10-27(11-17(16)13-28)21(30)19-9-18(31-3)4-5-20(19)29-23-6-7-24-29/h4-9,16-17H,10-13H2,1-3H3/t16-,17+
Reactome pathway
n/an/a 8.10E+3n/an/an/an/an/an/a
TBA
Curated by ChEMBL
Assay Description
Inhibition of [3H]-astemizole binding to human ERG expressed in HEK293 cells
J Med Chem 58: 5620-36 (2015)
Article DOI: 10.1021/acs.jmedchem.5b00742
BindingDB Entry DOI: 10.7270/Q2QR4ZWG