BDBM50097554 CASEARBORIN D::Casearborin D
SMILES: [H][C@@]12C[C@@H](OC(=O)c3ccc(O)cc3)C=C3[C@@H](OC(C)=O)O[C@@H](OC(C)=O)[C@@]13[C@@H](O)C[C@@H](C)[C@@]2(C)C\C=C(/C)C=C
InChI Key: InChIKey=NHFNTUZGNJGHGQ-UHFFFAOYSA-N
Data: 1 Kd
Activity Spreadsheet -- Enzyme Inhibition Constant Data from BindingDB
Found 1 hit for monomerid = 50097554
Trg + Lig
Ki
nM
ΔG°
kcal/mole
IC50
nM
Kd
nM
EC50/IC50
nM
koff
s-1
kon
M-1s-1
pHTemp
°C
Sarcoplasmic/endoplasmic reticulum calcium ATP-ase
(Oryctolagus cuniculus)
BDBM50097554
(CASEARBORIN D | Casearborin D)
Show SMILES [H][C@@]12C[C@@H](OC(=O)c3ccc(O)cc3)C=C3[C@@H](OC(C)=O)O[C@@H](OC(C)=O)[C@@]13[C@@H](O)C[C@@H](C)[C@@]2(C)C\C=C(/C)C=C |r,t:15|
Show InChI InChI=1S/C21H17N3O2/c1-23-19-18(17(12-13-22-19)16-10-6-3-7-11-16)20(25)24(21(23)26)14-15-8-4-2-5-9-15/h2-13H,14H2,1H3
n/an/an/a 2.00E+3n/an/an/an/an/a
Albert Ludwigs University Freiburg
Curated by ChEMBL
Assay Description
Binding affinity to rabbit skeletal muscle SERCA1a preincubated for 5 mins followed by Mg-ATP addition measured over 6 mins by spectrophotometric ana...
J Nat Prod 78: 1262-70 (2015)
Article DOI: 10.1021/acs.jnatprod.5b00062
BindingDB Entry DOI: 10.7270/Q2833TR2