null
SMILES: CCc1ccc(cc1)S(=O)(=O)N1CCc2cc(ccc2C1)C(=O)NCCN(Cc1ccc(Br)cc1)C(C)C
InChI Key: InChIKey=CGEGXWNPCFBZOH-UHFFFAOYSA-N
Activity Spreadsheet -- Enzyme Inhibition Constant Data from BindingDB
Found 3 hits for monomerid = 50097698
Trg + Lig
Ki
nM
ΔG°
kcal/mole
IC50
nM
Kd
nM
EC50/IC50
nM
koff
s-1
kon
M-1s-1
pHTemp
°C
Kappa-type opioid receptor
(Homo sapiens (Human))
BDBM50097698
(CHEMBL3590194)
Show SMILES CCc1ccc(cc1)S(=O)(=O)N1CCc2cc(ccc2C1)C(=O)NCCN(Cc1ccc(Br)cc1)C(C)C
Show InChI InChI=1S/C29H38FN5O4S/c1-3-4-5-6-7-8-13-33(2)26(37)20-35-19-24(16-23-17-31-28(39)34(18-23)14-15-36)27(38)32-29(35)40-21-22-9-11-25(30)12-10-22/h9-12,17-19,36H,3-8,13-16,20-21H2,1-2H3
Reactome pathway
n/an/a 33n/an/an/an/an/an/a
University of Kansas Specialized Chemistry Center
Curated by ChEMBL
Assay Description
Antagonist activity against HA-tagged human recombinant kappa opioid receptor expressed in CHO cell membranes incubated for 1 hr by [35S]GTPgammaS bi...
Bioorg Med Chem 23: 3948-56 (2015)
Article DOI: 10.1016/j.bmc.2014.12.033
BindingDB Entry DOI: 10.7270/Q2R49SJX
Kappa-type opioid receptor
(Homo sapiens (Human))
BDBM50097698
(CHEMBL3590194)
Show SMILES CCc1ccc(cc1)S(=O)(=O)N1CCc2cc(ccc2C1)C(=O)NCCN(Cc1ccc(Br)cc1)C(C)C
Show InChI InChI=1S/C29H38FN5O4S/c1-3-4-5-6-7-8-13-33(2)26(37)20-35-19-24(16-23-17-31-28(39)34(18-23)14-15-36)27(38)32-29(35)40-21-22-9-11-25(30)12-10-22/h9-12,17-19,36H,3-8,13-16,20-21H2,1-2H3
Reactome pathway
n/an/a 350n/an/an/an/an/an/a
University of Kansas Specialized Chemistry Center
Curated by ChEMBL
Assay Description
Antagonist activity against human kappa opioid receptor expressed in human U2OS cells co-expressing beta-arrestin2 pre-treated for 15 mins before U69...
Bioorg Med Chem 23: 3948-56 (2015)
Article DOI: 10.1016/j.bmc.2014.12.033
BindingDB Entry DOI: 10.7270/Q2R49SJX
Kappa-type opioid receptor
(Homo sapiens (Human))
BDBM50097698
(CHEMBL3590194)
Show SMILES CCc1ccc(cc1)S(=O)(=O)N1CCc2cc(ccc2C1)C(=O)NCCN(Cc1ccc(Br)cc1)C(C)C
Show InChI InChI=1S/C29H38FN5O4S/c1-3-4-5-6-7-8-13-33(2)26(37)20-35-19-24(16-23-17-31-28(39)34(18-23)14-15-36)27(38)32-29(35)40-21-22-9-11-25(30)12-10-22/h9-12,17-19,36H,3-8,13-16,20-21H2,1-2H3
Reactome pathway
n/an/a 314n/an/an/an/an/an/a
University of Kansas Specialized Chemistry Center
Curated by ChEMBL
Assay Description
Antagonist activity against HA-tagged human recombinant kappa opioid receptor expressed in CHO cells assessed as inhibition of U69,593-induced ERK ph...
Bioorg Med Chem 23: 3948-56 (2015)
Article DOI: 10.1016/j.bmc.2014.12.033
BindingDB Entry DOI: 10.7270/Q2R49SJX