BDBM50097886 (1-Hydroxy-1-phosphono-octyl)-phosphonic acid::1-hydroxyoctane-1,1-diyldiphosphonic acid::CHEMBL298547
SMILES: CCCCCCCC(O)(P(O)(O)=O)P(O)(O)=O
InChI Key: InChIKey=ITCAYUFDTCVNTE-UHFFFAOYSA-N
Data: 2 KI  6 IC50
Activity Spreadsheet -- Enzyme Inhibition Constant Data from BindingDB
Found 8 hits for monomerid = 50097886
Trg + Lig
Ki
nM
ΔG°
kcal/mole
IC50
nM
Kd
nM
EC50/IC50
nM
koff
s-1
kon
M-1s-1
pHTemp
°C
Farnesyl diphosphate synthase
(Homo sapiens (Human))
BDBM50097886
((1-Hydroxy-1-phosphono-octyl)-phosphonic acid | 1-...)
Show SMILES CCCCCCCC(O)(P(O)(O)=O)P(O)(O)=O
Show InChI InChI=1S/C8H20O7P2/c1-2-3-4-5-6-7-8(9,16(10,11)12)17(13,14)15/h9H,2-7H2,1H3,(H2,10,11,12)(H2,13,14,15)
Reactome pathway
980n/an/an/an/an/an/an/an/a
Universidad de Buenos Aires
Curated by ChEMBL
Assay Description
Binding affinity of the compound towards T. cruzi farnesyl pyrophosphate synthase (TcFPPS)
Bioorg Med Chem Lett 13: 3231-5 (2003)
BindingDB Entry DOI: 10.7270/Q2ZK5G2R
Farnesyl diphosphate synthase
(Homo sapiens (Human))
BDBM50097886
((1-Hydroxy-1-phosphono-octyl)-phosphonic acid | 1-...)
Show SMILES CCCCCCCC(O)(P(O)(O)=O)P(O)(O)=O
Show InChI InChI=1S/C8H20O7P2/c1-2-3-4-5-6-7-8(9,16(10,11)12)17(13,14)15/h9H,2-7H2,1H3,(H2,10,11,12)(H2,13,14,15)
Reactome pathway
1.90E+3n/an/an/an/an/an/an/an/a
University of Illinois at Urbana-Champaign
Curated by ChEMBL
Assay Description
Binding affinity towards farnesyl Pyrophosphate Synthase using [14C]- isopentenyl pyrophosphate as radioligand
J Med Chem 46: 5171-83 (2003)
Article DOI: 10.1021/jm0302344
BindingDB Entry DOI: 10.7270/Q24M93Z8
Farnesyl pyrophosphate synthase
(Plasmodium falciparum (isolate 3D7))
BDBM50097886
((1-Hydroxy-1-phosphono-octyl)-phosphonic acid | 1-...)
Show SMILES CCCCCCCC(O)(P(O)(O)=O)P(O)(O)=O
Show InChI InChI=1S/C8H20O7P2/c1-2-3-4-5-6-7-8(9,16(10,11)12)17(13,14)15/h9H,2-7H2,1H3,(H2,10,11,12)(H2,13,14,15)
n/an/a 1.99E+4n/an/an/an/an/an/a
University of Illinois at Urbana-Champaign
Curated by ChEMBL
Assay Description
Inhibitory activity against Leishmania major Farnesyl diphosphate synthase
J Med Chem 47: 175-87 (2003)
Article DOI: 10.1021/jm030084x
BindingDB Entry DOI: 10.7270/Q2FN15N5
Farnesyl diphosphate synthase
(Homo sapiens (Human))
BDBM50097886
((1-Hydroxy-1-phosphono-octyl)-phosphonic acid | 1-...)
Show SMILES CCCCCCCC(O)(P(O)(O)=O)P(O)(O)=O
Show InChI InChI=1S/C8H20O7P2/c1-2-3-4-5-6-7-8(9,16(10,11)12)17(13,14)15/h9H,2-7H2,1H3,(H2,10,11,12)(H2,13,14,15)
Reactome pathway
n/an/a 3.57E+3n/an/an/an/an/an/a
Universidad de Buenos Aires
Curated by ChEMBL
Assay Description
Inhibition of Trypanosoma cruzi farnesyl pyrophosphate synthase
Bioorg Med Chem Lett 13: 3231-5 (2003)
BindingDB Entry DOI: 10.7270/Q2ZK5G2R
Farnesyl diphosphate synthase
(Homo sapiens (Human))
BDBM50097886
((1-Hydroxy-1-phosphono-octyl)-phosphonic acid | 1-...)
Show SMILES CCCCCCCC(O)(P(O)(O)=O)P(O)(O)=O
Show InChI InChI=1S/C8H20O7P2/c1-2-3-4-5-6-7-8(9,16(10,11)12)17(13,14)15/h9H,2-7H2,1H3,(H2,10,11,12)(H2,13,14,15)
Reactome pathway
n/an/a 9.36E+3n/an/an/an/an/an/a
Universidad de Buenos Aires
Curated by ChEMBL
Assay Description
Binding affinity of the compound towards T. cruzi farnesyl pyrophosphate synthase (TcFPPS)
Bioorg Med Chem Lett 13: 3231-5 (2003)
BindingDB Entry DOI: 10.7270/Q2ZK5G2R
Farnesyl diphosphate synthase
(Homo sapiens (Human))
BDBM50097886
((1-Hydroxy-1-phosphono-octyl)-phosphonic acid | 1-...)
Show SMILES CCCCCCCC(O)(P(O)(O)=O)P(O)(O)=O
Show InChI InChI=1S/C8H20O7P2/c1-2-3-4-5-6-7-8(9,16(10,11)12)17(13,14)15/h9H,2-7H2,1H3,(H2,10,11,12)(H2,13,14,15)
Reactome pathway
n/an/a 2.00E+4n/an/an/an/an/an/a
University of Illinois at Urbana-Champaign
Curated by ChEMBL
Assay Description
Inhibitory activity against farnesyl Pyrophosphate Synthase expressed as #NAME? (M)
J Med Chem 46: 5171-83 (2003)
Article DOI: 10.1021/jm0302344
BindingDB Entry DOI: 10.7270/Q24M93Z8
Geranylgeranyl Diphosphate Synthase (GGPPS)
(Homo sapiens (Human))
BDBM50097886
((1-Hydroxy-1-phosphono-octyl)-phosphonic acid | 1-...)
Show SMILES CCCCCCCC(O)(P(O)(O)=O)P(O)(O)=O
Show InChI InChI=1S/C8H20O7P2/c1-2-3-4-5-6-7-8(9,16(10,11)12)17(13,14)15/h9H,2-7H2,1H3,(H2,10,11,12)(H2,13,14,15)
Reactome pathway
n/an/a 4.30E+3n/an/an/an/an/an/a
University of Illinois at Urbana-Champaign
Curated by ChEMBL
Assay Description
Inhibitory activity against the human recombinant geranylgeranyl diphosphate synthase (GGPPSase).
J Med Chem 45: 2185-96 (2002)
BindingDB Entry DOI: 10.7270/Q2KH0MN1
Farnesyl diphosphate synthase
(Homo sapiens (Human))
BDBM50097886
((1-Hydroxy-1-phosphono-octyl)-phosphonic acid | 1-...)
Show SMILES CCCCCCCC(O)(P(O)(O)=O)P(O)(O)=O
Show InChI InChI=1S/C8H20O7P2/c1-2-3-4-5-6-7-8(9,16(10,11)12)17(13,14)15/h9H,2-7H2,1H3,(H2,10,11,12)(H2,13,14,15)
Reactome pathway
n/an/a 2.00E+4n/an/an/an/an/an/a
University of Illinois at Urbana-Champaign
Curated by ChEMBL
Assay Description
Inhibitory activity against farnesyl Pyrophosphate Synthase was determined
J Med Chem 46: 5171-83 (2003)
Article DOI: 10.1021/jm0302344
BindingDB Entry DOI: 10.7270/Q24M93Z8