null
SMILES: Brc1ccc(NC(=O)N[C@@H](Cc2ccccc2)C(=O)N2CCCC2)cc1
InChI Key: InChIKey=FYEIEZCMIBWUOX-UHFFFAOYSA-N
Activity Spreadsheet -- Enzyme Inhibition Constant Data from BindingDB
Found 1 hit for monomerid = 50098178
Trg + Lig
Ki
nM
ΔG°
kcal/mole
IC50
nM
Kd
nM
EC50/IC50
nM
koff
s-1
kon
M-1s-1
pHTemp
°C
N-formyl peptide receptor 2
(Homo sapiens (Human))
BDBM50098178
(CHEMBL3588925)
Show SMILES Brc1ccc(NC(=O)N[C@@H](Cc2ccccc2)C(=O)N2CCCC2)cc1 |r|
Show InChI InChI=1S/C21H29NO/c1-15(2)19-11-18(12-20(16(3)4)21(19)23)14-22(5)13-17-9-7-6-8-10-17/h6-12,15-16,23H,13-14H2,1-5H3
NCI pathway
Reactome pathway
n/an/an/an/a 140n/an/an/an/a
University of Warsaw
Curated by ChEMBL
Assay Description
Agonist activity against human FPR2 expressed in human HL60 cells by Fluo-4AM dye based intracellular Ca2+ mobilization assay
Bioorg Med Chem 23: 4072-81 (2015)
Article DOI: 10.1016/j.bmc.2015.03.062
BindingDB Entry DOI: 10.7270/Q2KD20PR