BDBM50098184 AG-26::CHEMBL1289260
SMILES: COc1ccc(CCNC(=O)Nc2ccc(Cl)cc2)cc1
InChI Key: InChIKey=WIPQUJFDHZDVES-UHFFFAOYSA-N
Data: 1 EC50
Activity Spreadsheet -- Enzyme Inhibition Constant Data from BindingDB
Found 1 hit for monomerid = 50098184
Trg + Lig
Ki
nM
ΔG°
kcal/mole
IC50
nM
Kd
nM
EC50/IC50
nM
koff
s-1
kon
M-1s-1
pHTemp
°C
N-formyl peptide receptor 2
(Homo sapiens (Human))
BDBM50098184
(AG-26 | CHEMBL1289260)
Show SMILES COc1ccc(CCNC(=O)Nc2ccc(Cl)cc2)cc1
Show InChI InChI=1S/C19H32N2O/c1-14(2)17-11-16(13-21-7-9-22-10-8-21)12-18(15(3)4)19(17)20(5)6/h11-12,14-15H,7-10,13H2,1-6H3
NCI pathway
Reactome pathway
n/an/an/an/a 400n/an/an/an/a
University of Warsaw
Curated by ChEMBL
Assay Description
Agonist activity against human FPR2 expressed in human HL60 cells by Fluo-4AM dye based intracellular Ca2+ mobilization assay
Bioorg Med Chem 23: 4072-81 (2015)
Article DOI: 10.1016/j.bmc.2015.03.062
BindingDB Entry DOI: 10.7270/Q2KD20PR