BDBM50098374 CHEMBL3593394
SMILES: Cl.OC[C@H]1CNCCO[C@H]1c1ccc(Cl)c(Cl)c1
InChI Key: InChIKey=DPBWDEASAJPMOL-SKDRFNHKSA-N
Data: 3 IC50
Activity Spreadsheet -- Enzyme Inhibition Constant Data from BindingDB
Found 3 hits for monomerid = 50098374
Trg + Lig
Ki
nM
ΔG°
kcal/mole
IC50
nM
Kd
nM
EC50/IC50
nM
koff
s-1
kon
M-1s-1
pHTemp
°C
Sodium-dependent serotonin transporter
(Homo sapiens (Human))
BDBM50098374
(CHEMBL3593394)
Show SMILES Cl.OC[C@H]1CNCCO[C@H]1c1ccc(Cl)c(Cl)c1 |r|
Show InChI InChI=1S/C12H15Cl2NO2/c13-10-2-1-8(5-11(10)14)12-9(7-16)6-15-3-4-17-12/h1-2,5,9,12,15-16H,3-4,6-7H2/t9-,12+/m1/s1
n/an/a 120n/an/an/an/an/an/a
Takeda Pharmaceutical Company Ltd
Curated by ChEMBL
Assay Description
Inhibition of human SERT expressed in CHOK1 cells incubated for 20 mins by [3H]-5-hydroxytryptamine uptake assay
Bioorg Med Chem 23: 5000-14 (2015)
Article DOI: 10.1016/j.bmc.2015.05.017
BindingDB Entry DOI: 10.7270/Q22F7Q6R
Sodium-dependent dopamine transporter
(Homo sapiens (Human))
BDBM50098374
(CHEMBL3593394)
Show SMILES Cl.OC[C@H]1CNCCO[C@H]1c1ccc(Cl)c(Cl)c1 |r|
Show InChI InChI=1S/C12H15Cl2NO2/c13-10-2-1-8(5-11(10)14)12-9(7-16)6-15-3-4-17-12/h1-2,5,9,12,15-16H,3-4,6-7H2/t9-,12+/m1/s1
NCI pathway
Reactome pathway
n/an/a>1.00E+3n/an/an/an/an/an/a
Takeda Pharmaceutical Company Ltd
Curated by ChEMBL
Assay Description
Inhibition of human DAT expressed in CHOK1 cells incubated for 60 mins by [3H]-dopamine uptake assay
Bioorg Med Chem 23: 5000-14 (2015)
Article DOI: 10.1016/j.bmc.2015.05.017
BindingDB Entry DOI: 10.7270/Q22F7Q6R
Sodium-dependent noradrenaline transporter
(Homo sapiens (Human))
BDBM50098374
(CHEMBL3593394)
Show SMILES Cl.OC[C@H]1CNCCO[C@H]1c1ccc(Cl)c(Cl)c1 |r|
Show InChI InChI=1S/C12H15Cl2NO2/c13-10-2-1-8(5-11(10)14)12-9(7-16)6-15-3-4-17-12/h1-2,5,9,12,15-16H,3-4,6-7H2/t9-,12+/m1/s1
Reactome pathway
n/an/a 6n/an/an/an/an/an/a
Takeda Pharmaceutical Company Ltd
Curated by ChEMBL
Assay Description
Inhibition of human NET expressed in CHOK1 cells incubated for 45 mins by [3H]-norepinephrine uptake assay
Bioorg Med Chem 23: 5000-14 (2015)
Article DOI: 10.1016/j.bmc.2015.05.017
BindingDB Entry DOI: 10.7270/Q22F7Q6R