BDBM50098381 (3-Amino-1-hydroxy-1-phosphono-butyl)-phosphonic acid::3-amino-1-hydroxybutane-1,1-diyldiphosphonic acid::3-aminobutane-1-hydroxy-1,1-bisphosphonate::CHEMBL55358
SMILES: CC(N)CC(O)(P(O)(O)=O)P(O)(O)=O
InChI Key: InChIKey=FNPLDQVMNZFNEG-UHFFFAOYSA-N
Data: 1 KI  3 IC50
Activity Spreadsheet -- Enzyme Inhibition Constant Data from BindingDB
Found 4 hits for monomerid = 50098381
Trg + Lig
Ki
nM
ΔG°
kcal/mole
IC50
nM
Kd
nM
EC50/IC50
nM
koff
s-1
kon
M-1s-1
pHTemp
°C
Farnesyl diphosphate synthase
(Homo sapiens (Human))
BDBM50098381
((3-Amino-1-hydroxy-1-phosphono-butyl)-phosphonic a...)
Show SMILES CC(N)CC(O)(P(O)(O)=O)P(O)(O)=O
Show InChI InChI=1S/C4H13NO7P2/c1-3(5)2-4(6,13(7,8)9)14(10,11)12/h3,6H,2,5H2,1H3,(H2,7,8,9)(H2,10,11,12)
Reactome pathway
100n/an/an/an/an/an/an/an/a
University of Illinois at Urbana-Champaign
Curated by ChEMBL
Assay Description
Binding affinity towards farnesyl Pyrophosphate Synthase using [14C]- isopentenyl pyrophosphate as radioligand
J Med Chem 46: 5171-83 (2003)
Article DOI: 10.1021/jm0302344
BindingDB Entry DOI: 10.7270/Q24M93Z8
3D
3D Structure (docked)
Farnesyl diphosphate synthase
(Homo sapiens (Human))
BDBM50098381
((3-Amino-1-hydroxy-1-phosphono-butyl)-phosphonic a...)
Show SMILES CC(N)CC(O)(P(O)(O)=O)P(O)(O)=O
Show InChI InChI=1S/C4H13NO7P2/c1-3(5)2-4(6,13(7,8)9)14(10,11)12/h3,6H,2,5H2,1H3,(H2,7,8,9)(H2,10,11,12)
Reactome pathway
n/an/a 1.05E+3n/an/an/an/an/an/a
University of Illinois at Urbana-Champaign
Curated by ChEMBL
Assay Description
Inhibitory activity against farnesyl Pyrophosphate Synthase expressed as #NAME? (M)
J Med Chem 46: 5171-83 (2003)
Article DOI: 10.1021/jm0302344
BindingDB Entry DOI: 10.7270/Q24M93Z8
3D
3D Structure (docked)
Farnesyl diphosphate synthase
(Homo sapiens (Human))
BDBM50098381
((3-Amino-1-hydroxy-1-phosphono-butyl)-phosphonic a...)
Show SMILES CC(N)CC(O)(P(O)(O)=O)P(O)(O)=O
Show InChI InChI=1S/C4H13NO7P2/c1-3(5)2-4(6,13(7,8)9)14(10,11)12/h3,6H,2,5H2,1H3,(H2,7,8,9)(H2,10,11,12)
Reactome pathway
n/an/a 1.00E+3n/an/an/an/an/an/a
University of Illinois at Urbana-Champaign
Curated by ChEMBL
Assay Description
Inhibitory activity against farnesyl Pyrophosphate Synthase was determined
J Med Chem 46: 5171-83 (2003)
Article DOI: 10.1021/jm0302344
BindingDB Entry DOI: 10.7270/Q24M93Z8
3D
3D Structure (docked)
Geranylgeranyl Diphosphate Synthase (GGPPS)
(Homo sapiens (Human))
BDBM50098381
((3-Amino-1-hydroxy-1-phosphono-butyl)-phosphonic a...)
Show SMILES CC(N)CC(O)(P(O)(O)=O)P(O)(O)=O
Show InChI InChI=1S/C4H13NO7P2/c1-3(5)2-4(6,13(7,8)9)14(10,11)12/h3,6H,2,5H2,1H3,(H2,7,8,9)(H2,10,11,12)
Reactome pathway
n/an/a 3.30E+5n/an/an/an/an/an/a
University of Illinois at Urbana-Champaign
Curated by ChEMBL
Assay Description
Inhibitory activity against the human recombinant geranylgeranyl diphosphate synthase (GGPPSase).
J Med Chem 45: 2185-96 (2002)
BindingDB Entry DOI: 10.7270/Q2KH0MN1