BDBM50098387 CHEMBL3593274
SMILES: Cl.OCC1(CCCNCC1)c1ccc(Cl)c(Cl)c1
InChI Key: InChIKey=XUOKRSFCQZECDU-UHFFFAOYSA-N
Data: 3 IC50
Activity Spreadsheet -- Enzyme Inhibition Constant Data from BindingDB
Found 3 hits for monomerid = 50098387
Trg + Lig
Ki
nM
ΔG°
kcal/mole
IC50
nM
Kd
nM
EC50/IC50
nM
koff
s-1
kon
M-1s-1
pHTemp
°C
Sodium-dependent serotonin transporter
(Homo sapiens (Human))
BDBM50098387
(CHEMBL3593274)
Show SMILES Cl.OCC1(CCCNCC1)c1ccc(Cl)c(Cl)c1
Show InChI InChI=1S/C13H17Cl2NO/c14-11-3-2-10(8-12(11)15)13(9-17)4-1-6-16-7-5-13/h2-3,8,16-17H,1,4-7,9H2
n/an/a 35n/an/an/an/an/an/a
Takeda Pharmaceutical Company Ltd
Curated by ChEMBL
Assay Description
Inhibition of human SERT expressed in CHOK1 cells incubated for 20 mins by [3H]-5-hydroxytryptamine uptake assay
Bioorg Med Chem 23: 5000-14 (2015)
Article DOI: 10.1016/j.bmc.2015.05.017
BindingDB Entry DOI: 10.7270/Q22F7Q6R
Sodium-dependent dopamine transporter
(Homo sapiens (Human))
BDBM50098387
(CHEMBL3593274)
Show SMILES Cl.OCC1(CCCNCC1)c1ccc(Cl)c(Cl)c1
Show InChI InChI=1S/C13H17Cl2NO/c14-11-3-2-10(8-12(11)15)13(9-17)4-1-6-16-7-5-13/h2-3,8,16-17H,1,4-7,9H2
NCI pathway
Reactome pathway
n/an/a>1.00E+3n/an/an/an/an/an/a
Takeda Pharmaceutical Company Ltd
Curated by ChEMBL
Assay Description
Inhibition of human DAT expressed in CHOK1 cells incubated for 60 mins by [3H]-dopamine uptake assay
Bioorg Med Chem 23: 5000-14 (2015)
Article DOI: 10.1016/j.bmc.2015.05.017
BindingDB Entry DOI: 10.7270/Q22F7Q6R
Sodium-dependent noradrenaline transporter
(Homo sapiens (Human))
BDBM50098387
(CHEMBL3593274)
Show SMILES Cl.OCC1(CCCNCC1)c1ccc(Cl)c(Cl)c1
Show InChI InChI=1S/C13H17Cl2NO/c14-11-3-2-10(8-12(11)15)13(9-17)4-1-6-16-7-5-13/h2-3,8,16-17H,1,4-7,9H2
Reactome pathway
n/an/a 2.10n/an/an/an/an/an/a
Takeda Pharmaceutical Company Ltd
Curated by ChEMBL
Assay Description
Inhibition of human NET expressed in CHOK1 cells incubated for 45 mins by [3H]-norepinephrine uptake assay
Bioorg Med Chem 23: 5000-14 (2015)
Article DOI: 10.1016/j.bmc.2015.05.017
BindingDB Entry DOI: 10.7270/Q22F7Q6R