BDBM50098408 CHEMBL3593404
SMILES: Cl.CC(=O)NC[C@@H]1CNCCO[C@H]1c1ccc(Cl)c(C)c1
InChI Key: InChIKey=QICLPXGAKJXOIN-ZFWWWQNUSA-N
Data: 3 IC50
Activity Spreadsheet -- Enzyme Inhibition Constant Data from BindingDB
Found 3 hits for monomerid = 50098408
Trg + Lig
Ki
nM
ΔG°
kcal/mole
IC50
nM
Kd
nM
EC50/IC50
nM
koff
s-1
kon
M-1s-1
pHTemp
°C
Sodium-dependent noradrenaline transporter
(Homo sapiens (Human))
BDBM50098408
(CHEMBL3593404)
Show SMILES Cl.CC(=O)NC[C@@H]1CNCCO[C@H]1c1ccc(Cl)c(C)c1 |r|
Show InChI InChI=1S/C15H21ClN2O2/c1-10-7-12(3-4-14(10)16)15-13(9-18-11(2)19)8-17-5-6-20-15/h3-4,7,13,15,17H,5-6,8-9H2,1-2H3,(H,18,19)/t13-,15-/m0/s1
Reactome pathway
n/an/a 3.30n/an/an/an/an/an/a
Takeda Pharmaceutical Company Ltd
Curated by ChEMBL
Assay Description
Inhibition of human NET expressed in CHOK1 cells incubated for 45 mins by [3H]-norepinephrine uptake assay
Bioorg Med Chem 23: 5000-14 (2015)
Article DOI: 10.1016/j.bmc.2015.05.017
BindingDB Entry DOI: 10.7270/Q22F7Q6R
Sodium-dependent dopamine transporter
(Homo sapiens (Human))
BDBM50098408
(CHEMBL3593404)
Show SMILES Cl.CC(=O)NC[C@@H]1CNCCO[C@H]1c1ccc(Cl)c(C)c1 |r|
Show InChI InChI=1S/C15H21ClN2O2/c1-10-7-12(3-4-14(10)16)15-13(9-18-11(2)19)8-17-5-6-20-15/h3-4,7,13,15,17H,5-6,8-9H2,1-2H3,(H,18,19)/t13-,15-/m0/s1
NCI pathway
Reactome pathway
n/an/a>1.00E+3n/an/an/an/an/an/a
Takeda Pharmaceutical Company Ltd
Curated by ChEMBL
Assay Description
Inhibition of human DAT expressed in CHOK1 cells incubated for 60 mins by [3H]-dopamine uptake assay
Bioorg Med Chem 23: 5000-14 (2015)
Article DOI: 10.1016/j.bmc.2015.05.017
BindingDB Entry DOI: 10.7270/Q22F7Q6R
Sodium-dependent serotonin transporter
(Homo sapiens (Human))
BDBM50098408
(CHEMBL3593404)
Show SMILES Cl.CC(=O)NC[C@@H]1CNCCO[C@H]1c1ccc(Cl)c(C)c1 |r|
Show InChI InChI=1S/C15H21ClN2O2/c1-10-7-12(3-4-14(10)16)15-13(9-18-11(2)19)8-17-5-6-20-15/h3-4,7,13,15,17H,5-6,8-9H2,1-2H3,(H,18,19)/t13-,15-/m0/s1
n/an/a 480n/an/an/an/an/an/a
Takeda Pharmaceutical Company Ltd
Curated by ChEMBL
Assay Description
Inhibition of human SERT expressed in CHOK1 cells incubated for 20 mins by [3H]-5-hydroxytryptamine uptake assay
Bioorg Med Chem 23: 5000-14 (2015)
Article DOI: 10.1016/j.bmc.2015.05.017
BindingDB Entry DOI: 10.7270/Q22F7Q6R