BDBM50098413 CHEMBL3593399
SMILES: Cl.CN(C)C(=O)[C@@H]1CNCCO[C@H]1c1ccc(Cl)c(Cl)c1
InChI Key: InChIKey=JYATVHIJHCVTMN-MFKMUULPSA-N
Data: 3 IC50
Activity Spreadsheet -- Enzyme Inhibition Constant Data from BindingDB
Found 3 hits for monomerid = 50098413
Trg + Lig
Ki
nM
ΔG°
kcal/mole
IC50
nM
Kd
nM
EC50/IC50
nM
koff
s-1
kon
M-1s-1
pHTemp
°C
Sodium-dependent noradrenaline transporter
(Homo sapiens (Human))
BDBM50098413
(CHEMBL3593399)
Show SMILES Cl.CN(C)C(=O)[C@@H]1CNCCO[C@H]1c1ccc(Cl)c(Cl)c1 |r|
Show InChI InChI=1S/C14H18Cl2N2O2/c1-18(2)14(19)10-8-17-5-6-20-13(10)9-3-4-11(15)12(16)7-9/h3-4,7,10,13,17H,5-6,8H2,1-2H3/t10-,13+/m1/s1
Reactome pathway
n/an/a 0.770n/an/an/an/an/an/a
Takeda Pharmaceutical Company Ltd
Curated by ChEMBL
Assay Description
Inhibition of human NET expressed in CHOK1 cells incubated for 45 mins by [3H]-norepinephrine uptake assay
Bioorg Med Chem 23: 5000-14 (2015)
Article DOI: 10.1016/j.bmc.2015.05.017
BindingDB Entry DOI: 10.7270/Q22F7Q6R
Sodium-dependent dopamine transporter
(Homo sapiens (Human))
BDBM50098413
(CHEMBL3593399)
Show SMILES Cl.CN(C)C(=O)[C@@H]1CNCCO[C@H]1c1ccc(Cl)c(Cl)c1 |r|
Show InChI InChI=1S/C14H18Cl2N2O2/c1-18(2)14(19)10-8-17-5-6-20-13(10)9-3-4-11(15)12(16)7-9/h3-4,7,10,13,17H,5-6,8H2,1-2H3/t10-,13+/m1/s1
NCI pathway
Reactome pathway
n/an/a 70n/an/an/an/an/an/a
Takeda Pharmaceutical Company Ltd
Curated by ChEMBL
Assay Description
Inhibition of human DAT expressed in CHOK1 cells incubated for 60 mins by [3H]-dopamine uptake assay
Bioorg Med Chem 23: 5000-14 (2015)
Article DOI: 10.1016/j.bmc.2015.05.017
BindingDB Entry DOI: 10.7270/Q22F7Q6R
Sodium-dependent serotonin transporter
(Homo sapiens (Human))
BDBM50098413
(CHEMBL3593399)
Show SMILES Cl.CN(C)C(=O)[C@@H]1CNCCO[C@H]1c1ccc(Cl)c(Cl)c1 |r|
Show InChI InChI=1S/C14H18Cl2N2O2/c1-18(2)14(19)10-8-17-5-6-20-13(10)9-3-4-11(15)12(16)7-9/h3-4,7,10,13,17H,5-6,8H2,1-2H3/t10-,13+/m1/s1
n/an/a 350n/an/an/an/an/an/a
Takeda Pharmaceutical Company Ltd
Curated by ChEMBL
Assay Description
Inhibition of human SERT expressed in CHOK1 cells incubated for 20 mins by [3H]-5-hydroxytryptamine uptake assay
Bioorg Med Chem 23: 5000-14 (2015)
Article DOI: 10.1016/j.bmc.2015.05.017
BindingDB Entry DOI: 10.7270/Q22F7Q6R