BDBM50098472 (4-p-Tolylsulfanyl-thieno[2,3-c]pyridin-2-yl)-methanol::CHEMBL268530
SMILES: Cc1ccc(Sc2cncc3sc(CO)cc23)cc1
InChI Key: InChIKey=WJRCKUZHLDRTKL-UHFFFAOYSA-N
Data: 3 IC50
Activity Spreadsheet -- Enzyme Inhibition Constant Data from BindingDB
Found 3 hits for monomerid = 50098472
Trg + Lig
Ki
nM
ΔG°
kcal/mole
IC50
nM
Kd
nM
EC50/IC50
nM
koff
s-1
kon
M-1s-1
pHTemp
°C
VCAM-1
(Homo sapiens (Human))
BDBM50098472
((4-p-Tolylsulfanyl-thieno[2,3-c]pyridin-2-yl)-meth...)
Show SMILES Cc1ccc(Sc2cncc3sc(CO)cc23)cc1
Show InChI InChI=1S/C15H13NOS2/c1-10-2-4-11(5-3-10)18-14-7-16-8-15-13(14)6-12(9-17)19-15/h2-8,17H,9H2,1H3
n/an/a>4.00E+3n/an/an/an/an/an/a
Abbott Laboratories
Curated by ChEMBL
Assay Description
In vitro potency against TNF alpha induced expresion of VCAM-1 on human vascular endothelial cells using CAM ELISA assay
J Med Chem 44: 988-1002 (2001)
BindingDB Entry DOI: 10.7270/Q2CF9PC4
Intercellular adhesion molecule (ICAM-1), Integrin alpha-L/beta-2
(Homo sapiens (Human))
BDBM50098472
((4-p-Tolylsulfanyl-thieno[2,3-c]pyridin-2-yl)-meth...)
Show SMILES Cc1ccc(Sc2cncc3sc(CO)cc23)cc1
Show InChI InChI=1S/C15H13NOS2/c1-10-2-4-11(5-3-10)18-14-7-16-8-15-13(14)6-12(9-17)19-15/h2-8,17H,9H2,1H3
NCI pathway
Reactome pathway
n/an/a 540n/an/an/an/an/an/a
Abbott Laboratories
Curated by ChEMBL
Assay Description
In vitro potency against TNF alpha induced expresion of intercellular adhesion molecule-1 on human vascular endothelial cells using CAM ELISA assay
J Med Chem 44: 988-1002 (2001)
BindingDB Entry DOI: 10.7270/Q2CF9PC4
Selectin E
(Homo sapiens (Human))
BDBM50098472
((4-p-Tolylsulfanyl-thieno[2,3-c]pyridin-2-yl)-meth...)
Show SMILES Cc1ccc(Sc2cncc3sc(CO)cc23)cc1
Show InChI InChI=1S/C15H13NOS2/c1-10-2-4-11(5-3-10)18-14-7-16-8-15-13(14)6-12(9-17)19-15/h2-8,17H,9H2,1H3
NCI pathway
Reactome pathway
n/an/a 200n/an/an/an/an/an/a
Abbott Laboratories
Curated by ChEMBL
Assay Description
In vitro potency against TNF alpha induced expression of Selectin E on human vascular endothelial cells using CAM ELISA assay
J Med Chem 44: 988-1002 (2001)
BindingDB Entry DOI: 10.7270/Q2CF9PC4