BDBM50098487 4-p-Tolylsulfanyl-thieno[2,3-c]pyridine-2-carboxylic acid methoxy-amide::CHEMBL269075
SMILES: CONC(=O)c1cc2c(Sc3ccc(C)cc3)cncc2s1
InChI Key: InChIKey=YLPWORNATWTQBL-UHFFFAOYSA-N
Data: 3 IC50
Activity Spreadsheet -- Enzyme Inhibition Constant Data from BindingDB
Found 3 hits for monomerid = 50098487
Trg + Lig
Ki
nM
ΔG°
kcal/mole
IC50
nM
Kd
nM
EC50/IC50
nM
koff
s-1
kon
M-1s-1
pHTemp
°C
Intercellular adhesion molecule (ICAM-1), Integrin alpha-L/beta-2
(Homo sapiens (Human))
BDBM50098487
(4-p-Tolylsulfanyl-thieno[2,3-c]pyridine-2-carboxyl...)
Show SMILES CONC(=O)c1cc2c(Sc3ccc(C)cc3)cncc2s1
Show InChI InChI=1S/C16H14N2O2S2/c1-10-3-5-11(6-4-10)21-14-8-17-9-15-12(14)7-13(22-15)16(19)18-20-2/h3-9H,1-2H3,(H,18,19)
NCI pathway
Reactome pathway
n/an/a 170n/an/an/an/an/an/a
Abbott Laboratories
Curated by ChEMBL
Assay Description
In vitro potency against TNF alpha induced expresion of intercellular adhesion molecule-1 on human vascular endothelial cells using CAM ELISA assay
J Med Chem 44: 988-1002 (2001)
BindingDB Entry DOI: 10.7270/Q2CF9PC4
VCAM-1
(Homo sapiens (Human))
BDBM50098487
(4-p-Tolylsulfanyl-thieno[2,3-c]pyridine-2-carboxyl...)
Show SMILES CONC(=O)c1cc2c(Sc3ccc(C)cc3)cncc2s1
Show InChI InChI=1S/C16H14N2O2S2/c1-10-3-5-11(6-4-10)21-14-8-17-9-15-12(14)7-13(22-15)16(19)18-20-2/h3-9H,1-2H3,(H,18,19)
n/an/a 2.10E+4n/an/an/an/an/an/a
Abbott Laboratories
Curated by ChEMBL
Assay Description
In vitro potency against TNF alpha induced expresion of VCAM-1 on human vascular endothelial cells using CAM ELISA assay
J Med Chem 44: 988-1002 (2001)
BindingDB Entry DOI: 10.7270/Q2CF9PC4
Selectin E
(Homo sapiens (Human))
BDBM50098487
(4-p-Tolylsulfanyl-thieno[2,3-c]pyridine-2-carboxyl...)
Show SMILES CONC(=O)c1cc2c(Sc3ccc(C)cc3)cncc2s1
Show InChI InChI=1S/C16H14N2O2S2/c1-10-3-5-11(6-4-10)21-14-8-17-9-15-12(14)7-13(22-15)16(19)18-20-2/h3-9H,1-2H3,(H,18,19)
NCI pathway
Reactome pathway
n/an/a 88n/an/an/an/an/an/a
Abbott Laboratories
Curated by ChEMBL
Assay Description
In vitro potency against TNF alpha induced expression of Selectin E on human vascular endothelial cells using CAM ELISA assay
J Med Chem 44: 988-1002 (2001)
BindingDB Entry DOI: 10.7270/Q2CF9PC4