BDBM50098502 4-(3,4-Dichloro-phenylsulfanyl)-thieno[2,3-c]pyridine-2-carboxylic acid amide::CHEMBL6612
SMILES: NC(=O)c1cc2c(Sc3ccc(Cl)c(Cl)c3)cncc2s1
InChI Key: InChIKey=QVUTVXHVMPGTGU-UHFFFAOYSA-N
Data: 3 IC50
Activity Spreadsheet -- Enzyme Inhibition Constant Data from BindingDB
Found 3 hits for monomerid = 50098502
Trg + Lig
Ki
nM
ΔG°
kcal/mole
IC50
nM
Kd
nM
EC50/IC50
nM
koff
s-1
kon
M-1s-1
pHTemp
°C
VCAM-1
(Homo sapiens (Human))
BDBM50098502
(4-(3,4-Dichloro-phenylsulfanyl)-thieno[2,3-c]pyrid...)
Show SMILES NC(=O)c1cc2c(Sc3ccc(Cl)c(Cl)c3)cncc2s1
Show InChI InChI=1S/C14H8Cl2N2OS2/c15-9-2-1-7(3-10(9)16)20-12-5-18-6-13-8(12)4-11(21-13)14(17)19/h1-6H,(H2,17,19)
n/an/a>1.00E+3n/an/an/an/an/an/a
Abbott Laboratories
Curated by ChEMBL
Assay Description
In vitro potency against TNF alpha induced expresion of VCAM-1 on human vascular endothelial cells using CAM ELISA assay
J Med Chem 44: 988-1002 (2001)
BindingDB Entry DOI: 10.7270/Q2CF9PC4
Selectin E
(Homo sapiens (Human))
BDBM50098502
(4-(3,4-Dichloro-phenylsulfanyl)-thieno[2,3-c]pyrid...)
Show SMILES NC(=O)c1cc2c(Sc3ccc(Cl)c(Cl)c3)cncc2s1
Show InChI InChI=1S/C14H8Cl2N2OS2/c15-9-2-1-7(3-10(9)16)20-12-5-18-6-13-8(12)4-11(21-13)14(17)19/h1-6H,(H2,17,19)
NCI pathway
Reactome pathway
n/an/a 100n/an/an/an/an/an/a
Abbott Laboratories
Curated by ChEMBL
Assay Description
In vitro potency against TNF alpha induced expression of Selectin E on human vascular endothelial cells using CAM ELISA assay
J Med Chem 44: 988-1002 (2001)
BindingDB Entry DOI: 10.7270/Q2CF9PC4
Intercellular adhesion molecule (ICAM-1), Integrin alpha-L/beta-2
(Homo sapiens (Human))
BDBM50098502
(4-(3,4-Dichloro-phenylsulfanyl)-thieno[2,3-c]pyrid...)
Show SMILES NC(=O)c1cc2c(Sc3ccc(Cl)c(Cl)c3)cncc2s1
Show InChI InChI=1S/C14H8Cl2N2OS2/c15-9-2-1-7(3-10(9)16)20-12-5-18-6-13-8(12)4-11(21-13)14(17)19/h1-6H,(H2,17,19)
NCI pathway
Reactome pathway
n/an/a 37n/an/an/an/an/an/a
Abbott Laboratories
Curated by ChEMBL
Assay Description
In vitro potency against TNF alpha induced expresion of intercellular adhesion molecule-1 on human vascular endothelial cells using CAM ELISA assay
J Med Chem 44: 988-1002 (2001)
BindingDB Entry DOI: 10.7270/Q2CF9PC4