BDBM50098534 2-(8-Bromo-2,3,6,7-tetrahydro-benzo[1,2-b;4,5-b']difuran-4-yl)-1-methyl-ethyl-ammonium; chloride::CHEMBL263078
SMILES: C[C@H]([NH3+])Cc1c2CCOc2c(Br)c2CCOc12
InChI Key: InChIKey=FKRREVSELFOLDT-ZETCQYMHSA-O
Data: 2 KI  1 EC50
Activity Spreadsheet -- Enzyme Inhibition Constant Data from BindingDB
Found 3 hits for monomerid = 50098534
Trg + Lig
Ki
nM
ΔG°
kcal/mole
IC50
nM
Kd
nM
EC50/IC50
nM
koff
s-1
kon
M-1s-1
pHTemp
°C
Serotonin receptor 2a and 2c (5HT2A and 5HT2C)
(Rattus norvegicus (Rat))
BDBM50098534
(2-(8-Bromo-2,3,6,7-tetrahydro-benzo[1,2-b;4,5-b']d...)
Show SMILES C[C@H]([NH3+])Cc1c2CCOc2c(Br)c2CCOc12
Show InChI InChI=1S/C13H16BrNO2/c1-7(15)6-10-8-2-4-17-13(8)11(14)9-3-5-16-12(9)10/h7H,2-6,15H2,1H3/p+1/t7-/m0/s1
1.10n/an/an/an/an/an/an/an/a
Purdue University
Curated by ChEMBL
Assay Description
Binding affinity at cloned rat 5-hydroxytryptamine 2C receptor using [3H]-DOI as radioligand
J Med Chem 44: 1003-10 (2001)
BindingDB Entry DOI: 10.7270/Q27P8XND
5-hydroxytryptamine receptor 2A
(Rattus norvegicus (rat))
BDBM50098534
(2-(8-Bromo-2,3,6,7-tetrahydro-benzo[1,2-b;4,5-b']d...)
Show SMILES C[C@H]([NH3+])Cc1c2CCOc2c(Br)c2CCOc12
Show InChI InChI=1S/C13H16BrNO2/c1-7(15)6-10-8-2-4-17-13(8)11(14)9-3-5-16-12(9)10/h7H,2-6,15H2,1H3/p+1/t7-/m0/s1
Reactome pathway
2.60n/an/an/an/an/an/an/an/a
Purdue University
Curated by ChEMBL
Assay Description
Binding affinity at cloned rat 5-hydroxytryptamine 2A receptor using [3H]-DOB as radioligand
J Med Chem 44: 1003-10 (2001)
BindingDB Entry DOI: 10.7270/Q27P8XND
5-hydroxytryptamine receptor 2A
(Rattus norvegicus (rat))
BDBM50098534
(2-(8-Bromo-2,3,6,7-tetrahydro-benzo[1,2-b;4,5-b']d...)
Show SMILES C[C@H]([NH3+])Cc1c2CCOc2c(Br)c2CCOc12
Show InChI InChI=1S/C13H16BrNO2/c1-7(15)6-10-8-2-4-17-13(8)11(14)9-3-5-16-12(9)10/h7H,2-6,15H2,1H3/p+1/t7-/m0/s1
Reactome pathway
n/an/an/an/a 35n/an/an/an/a
Purdue University
Curated by ChEMBL
Assay Description
Ability to stimulate phosphoinositide hydrolysis in NIH3T3 cells expressing the 5-hydroxytryptamine 2A receptor
J Med Chem 44: 1003-10 (2001)
BindingDB Entry DOI: 10.7270/Q27P8XND