null
SMILES: CC[N+]1(C\C2=C\CCCCCC2)CCC(CC1)NC(=O)C1c2cc(Cl)ccc2Oc2ccc(Cl)cc12
InChI Key: InChIKey=FOAFBMYSXIGAOX-LQGGPMKRSA-N
Activity Spreadsheet -- Enzyme Inhibition Constant Data from BindingDB
Found 2 hits for monomerid = 50098643
Trg + Lig
Ki
nM
ΔG°
kcal/mole
IC50
nM
Kd
nM
EC50/IC50
nM
koff
s-1
kon
M-1s-1
pHTemp
°C
C-C chemokine receptor type 3
(Homo sapiens (Human))
BDBM50098643
(1-((E)-1-Cyclooct-1-enyl)methyl-4-[(2,7-dichloro-9...)
Show SMILES CC[N+]1(C\C2=C\CCCCCC2)CCC(CC1)NC(=O)C1c2cc(Cl)ccc2Oc2ccc(Cl)cc12 |t:4|
Show InChI InChI=1S/C30H36Cl2N2O2.HI/c1-2-34(20-21-8-6-4-3-5-7-9-21)16-14-24(15-17-34)33-30(35)29-25-18-22(31)10-12-27(25)36-28-13-11-23(32)19-26(28)29;/h8,10-13,18-19,24,29H,2-7,9,14-17,20H2,1H3;1H/b21-8+;
Reactome pathway
n/an/a 0.580n/an/an/an/an/an/a
Banyu Tsukuba Research Institute
Curated by ChEMBL
Assay Description
Concentration required for 50% inhibition of [125I]-Eotaxin binding to human CCR3 receptor expressed in CHO cells
Bioorg Med Chem Lett 11: 1219-23 (2001)
BindingDB Entry DOI: 10.7270/Q22V2FDC
C-C chemokine receptor type 1
(Homo sapiens (Human))
BDBM50098643
(1-((E)-1-Cyclooct-1-enyl)methyl-4-[(2,7-dichloro-9...)
Show SMILES CC[N+]1(C\C2=C\CCCCCC2)CCC(CC1)NC(=O)C1c2cc(Cl)ccc2Oc2ccc(Cl)cc12 |t:4|
Show InChI InChI=1S/C30H36Cl2N2O2.HI/c1-2-34(20-21-8-6-4-3-5-7-9-21)16-14-24(15-17-34)33-30(35)29-25-18-22(31)10-12-27(25)36-28-13-11-23(32)19-26(28)29;/h8,10-13,18-19,24,29H,2-7,9,14-17,20H2,1H3;1H/b21-8+;
Reactome pathway
n/an/a 0.900n/an/an/an/an/an/a
Banyu Tsukuba Research Institute
Curated by ChEMBL
Assay Description
Concentration required for 50% inhibition of [125I]-Eotaxin binding to human CCR1 receptor expressed in CHO cells
Bioorg Med Chem Lett 11: 1219-23 (2001)
BindingDB Entry DOI: 10.7270/Q22V2FDC