BDBM50098651 1-Cyclooct-1-enylmethyl-1-methyl-4-[(9H-xanthene-9-carbonyl)-amino]-piperidinium; iodide::CHEMBL32257
SMILES:
InChI Key: InChIKey=KNGWUQRLMPAOOP-RCIYGFKVSA-N
Data: 2 IC50
Activity Spreadsheet -- Enzyme Inhibition Constant Data from BindingDB
Found 2 hits for monomerid = 50098651
Trg + Lig
Ki
nM
ΔG°
kcal/mole
IC50
nM
Kd
nM
EC50/IC50
nM
koff
s-1
kon
M-1s-1
pHTemp
°C
C-C chemokine receptor type 1
(Homo sapiens (Human))
BDBM50098651
(1-Cyclooct-1-enylmethyl-1-methyl-4-[(9H-xanthene-9...)
Show InChI InChI=1S/C29H36N2O2.HI/c1-31(21-22-11-5-3-2-4-6-12-22)19-17-23(18-20-31)30-29(32)28-24-13-7-9-15-26(24)33-27-16-10-8-14-25(27)28;/h7-11,13-16,23,28H,2-6,12,17-21H2,1H3;1H/b22-11+;
Reactome pathway
n/an/a 2.5n/an/an/an/an/an/a
Banyu Tsukuba Research Institute in collaboration with Merck Research Laboratories
Curated by ChEMBL
Assay Description
Inhibitory activity against [125I]-MIP-1 alpha binding to human CCR1 receptors.
J Med Chem 44: 1429-35 (2001)
BindingDB Entry DOI: 10.7270/Q2G73D0G
C-C chemokine receptor type 1
(Mus musculus)
BDBM50098651
(1-Cyclooct-1-enylmethyl-1-methyl-4-[(9H-xanthene-9...)
Show InChI InChI=1S/C29H36N2O2.HI/c1-31(21-22-11-5-3-2-4-6-12-22)19-17-23(18-20-31)30-29(32)28-24-13-7-9-15-26(24)33-27-16-10-8-14-25(27)28;/h7-11,13-16,23,28H,2-6,12,17-21H2,1H3;1H/b22-11+;
n/an/a 350n/an/an/an/an/an/a
Banyu Tsukuba Research Institute in collaboration with Merck Research Laboratories
Curated by ChEMBL
Assay Description
Inhibitory activity against [125I]-MIP-1 alpha binding to mouse CCR1 receptors.
J Med Chem 44: 1429-35 (2001)
BindingDB Entry DOI: 10.7270/Q2G73D0G