BDBM50098664 1-(4-{4-[2-Hydroxy-2-(4-hydroxy-3-methanesulfonylamino-phenyl)-ethylamino]-piperidin-1-yl}-benzoyl)-pyrrolidine-2-carboxylic acid::CHEMBL417325
SMILES: CS(=O)(=O)Nc1cc(ccc1O)[C@@H](O)CNC1CCN(CC1)c1ccc(cc1)C(=O)N1CCC[C@H]1C(O)=O
InChI Key: InChIKey=PSTMRGCDBFOIHC-UPVQGACJSA-N
Data: 3 EC50
Activity Spreadsheet -- Enzyme Inhibition Constant Data from BindingDB
Found 3 hits for monomerid = 50098664
Trg + Lig
Ki
nM
ΔG°
kcal/mole
IC50
nM
Kd
nM
EC50/IC50
nM
koff
s-1
kon
M-1s-1
pHTemp
°C
Beta-2 adrenergic receptor
(Homo sapiens (Human))
BDBM50098664
(1-(4-{4-[2-Hydroxy-2-(4-hydroxy-3-methanesulfonyla...)
Show SMILES CS(=O)(=O)Nc1cc(ccc1O)[C@@H](O)CNC1CCN(CC1)c1ccc(cc1)C(=O)N1CCC[C@H]1C(O)=O
Show InChI InChI=1S/C26H34N4O7S/c1-38(36,37)28-21-15-18(6-9-23(21)31)24(32)16-27-19-10-13-29(14-11-19)20-7-4-17(5-8-20)25(33)30-12-2-3-22(30)26(34)35/h4-9,15,19,22,24,27-28,31-32H,2-3,10-14,16H2,1H3,(H,34,35)/t22-,24-/m0/s1
Reactome pathway
n/an/an/an/a 20n/an/an/an/a
Wyeth-Ayerst Research
Curated by ChEMBL
Assay Description
Increased cAMP levels of Chinese hamster ovary (CHO) cells expressing human beta 2 adrenergic receptors
J Med Chem 44: 1456-66 (2001)
BindingDB Entry DOI: 10.7270/Q2T72J53
Beta-3 adrenergic receptor
(Homo sapiens (Human))
BDBM50098664
(1-(4-{4-[2-Hydroxy-2-(4-hydroxy-3-methanesulfonyla...)
Show SMILES CS(=O)(=O)Nc1cc(ccc1O)[C@@H](O)CNC1CCN(CC1)c1ccc(cc1)C(=O)N1CCC[C@H]1C(O)=O
Show InChI InChI=1S/C26H34N4O7S/c1-38(36,37)28-21-15-18(6-9-23(21)31)24(32)16-27-19-10-13-29(14-11-19)20-7-4-17(5-8-20)25(33)30-12-2-3-22(30)26(34)35/h4-9,15,19,22,24,27-28,31-32H,2-3,10-14,16H2,1H3,(H,34,35)/t22-,24-/m0/s1
Reactome pathway
n/an/an/an/a 98n/an/an/an/a
Wyeth-Ayerst Research
Curated by ChEMBL
Assay Description
In vitro increase in cAMP levels in Chinese hamster ovary cells expressing the human cloned beta 3 Adrenergic receptor.
J Med Chem 44: 1456-66 (2001)
BindingDB Entry DOI: 10.7270/Q2T72J53
Beta-1 adrenergic receptor
(Homo sapiens (Human))
BDBM50098664
(1-(4-{4-[2-Hydroxy-2-(4-hydroxy-3-methanesulfonyla...)
Show SMILES CS(=O)(=O)Nc1cc(ccc1O)[C@@H](O)CNC1CCN(CC1)c1ccc(cc1)C(=O)N1CCC[C@H]1C(O)=O
Show InChI InChI=1S/C26H34N4O7S/c1-38(36,37)28-21-15-18(6-9-23(21)31)24(32)16-27-19-10-13-29(14-11-19)20-7-4-17(5-8-20)25(33)30-12-2-3-22(30)26(34)35/h4-9,15,19,22,24,27-28,31-32H,2-3,10-14,16H2,1H3,(H,34,35)/t22-,24-/m0/s1
Reactome pathway
n/an/an/an/a<1n/an/an/an/a
Wyeth-Ayerst Research
Curated by ChEMBL
Assay Description
Increased cAMP levels of Chinese hamster ovary (CHO) cells expressing human beta 1 Adrenergic receptor
J Med Chem 44: 1456-66 (2001)
BindingDB Entry DOI: 10.7270/Q2T72J53