BDBM50098759 1-(4-Acetyl-piperazin-1-yl)-3-[3-chloro-4-(2-hydroxymethyl-2,3-dihydro-benzo[1,4]dioxin-6-ylsulfanyl)-phenyl]-propenone::CHEMBL19676
SMILES: CC(=O)N1CCN(CC1)C(=O)\C=C\c1ccc(Sc2ccc3OC(CO)COc3c2)c(Cl)c1
InChI Key: InChIKey=FVEAFWBHBUVJQZ-XVNBXDOJSA-N
Data: 1 IC50
Activity Spreadsheet -- Enzyme Inhibition Constant Data from BindingDB
Found 1 hit for monomerid = 50098759
Trg + Lig
Ki
nM
ΔG°
kcal/mole
IC50
nM
Kd
nM
EC50/IC50
nM
koff
s-1
kon
M-1s-1
pHTemp
°C
Integrin beta-2/Leukocyte adhesion glycoprotein LFA-1 alpha
(Homo sapiens (Human))
BDBM50098759
(1-(4-Acetyl-piperazin-1-yl)-3-[3-chloro-4-(2-hydro...)
Show SMILES CC(=O)N1CCN(CC1)C(=O)\C=C\c1ccc(Sc2ccc3OC(CO)COc3c2)c(Cl)c1
Show InChI InChI=1S/C24H25ClN2O5S/c1-16(29)26-8-10-27(11-9-26)24(30)7-3-17-2-6-23(20(25)12-17)33-19-4-5-21-22(13-19)31-15-18(14-28)32-21/h2-7,12-13,18,28H,8-11,14-15H2,1H3/b7-3+
n/an/a 20n/an/an/an/an/an/a
Abbott Laboratories
Curated by ChEMBL
Assay Description
Inhibition of JY-8 cell adhesion via leukocyte function associated antigen 1 (LFA-1) to ICAM-1
J Med Chem 44: 1202-10 (2001)
BindingDB Entry DOI: 10.7270/Q22Z14TP