BDBM50098919 (R)-1-Isopropyl-4-(4-methoxy-benzenesulfonyl)-7-oxo-[1,4]diazepane-5-carboxylic acid hydroxyamide::CHEMBL7756
SMILES: COc1ccc(cc1)S(=O)(=O)N1CCN(C(C)C)C(=O)C[C@@H]1C(=O)NO
InChI Key: InChIKey=HTNLSTWGHBHDPS-CQSZACIVSA-N
Data: 7 IC50
Activity Spreadsheet -- Enzyme Inhibition Constant Data from BindingDB
Found 7 hits for monomerid = 50098919
Trg + Lig
Ki
nM
ΔG°
kcal/mole
IC50
nM
Kd
nM
EC50/IC50
nM
koff
s-1
kon
M-1s-1
pHTemp
°C
Matrix metalloproteinase 13
(Rattus norvegicus)
BDBM50098919
((R)-1-Isopropyl-4-(4-methoxy-benzenesulfonyl)-7-ox...)
Show SMILES COc1ccc(cc1)S(=O)(=O)N1CCN(C(C)C)C(=O)C[C@@H]1C(=O)NO
Show InChI InChI=1S/C16H23N3O6S/c1-11(2)18-8-9-19(14(10-15(18)20)16(21)17-22)26(23,24)13-6-4-12(25-3)5-7-13/h4-7,11,14,22H,8-10H2,1-3H3,(H,17,21)/t14-/m1/s1
n/an/a 1.90n/an/an/an/an/an/a
Procter and Gamble Pharmaceuticals
Curated by ChEMBL
Assay Description
Inhibition of Matrix metalloprotease-13
Bioorg Med Chem Lett 11: 1009-13 (2001)
BindingDB Entry DOI: 10.7270/Q2X34Z04
Neutrophil collagenase
(Homo sapiens (Human))
BDBM50098919
((R)-1-Isopropyl-4-(4-methoxy-benzenesulfonyl)-7-ox...)
Show SMILES COc1ccc(cc1)S(=O)(=O)N1CCN(C(C)C)C(=O)C[C@@H]1C(=O)NO
Show InChI InChI=1S/C16H23N3O6S/c1-11(2)18-8-9-19(14(10-15(18)20)16(21)17-22)26(23,24)13-6-4-12(25-3)5-7-13/h4-7,11,14,22H,8-10H2,1-3H3,(H,17,21)/t14-/m1/s1
Reactome pathway
n/an/a 3.70n/an/an/an/an/an/a
Procter and Gamble Pharmaceuticals
Curated by ChEMBL
Assay Description
Inhibition of Matrix metalloprotease-8
Bioorg Med Chem Lett 11: 1009-13 (2001)
BindingDB Entry DOI: 10.7270/Q2X34Z04
Matrix metalloproteinase-7 (MMP7)
(Homo sapiens (Human))
BDBM50098919
((R)-1-Isopropyl-4-(4-methoxy-benzenesulfonyl)-7-ox...)
Show SMILES COc1ccc(cc1)S(=O)(=O)N1CCN(C(C)C)C(=O)C[C@@H]1C(=O)NO
Show InChI InChI=1S/C16H23N3O6S/c1-11(2)18-8-9-19(14(10-15(18)20)16(21)17-22)26(23,24)13-6-4-12(25-3)5-7-13/h4-7,11,14,22H,8-10H2,1-3H3,(H,17,21)/t14-/m1/s1
Reactome pathway
n/an/a 369n/an/an/an/an/an/a
Procter and Gamble Pharmaceuticals
Curated by ChEMBL
Assay Description
Inhibition of Matrix metalloprotease-7
Bioorg Med Chem Lett 11: 1009-13 (2001)
BindingDB Entry DOI: 10.7270/Q2X34Z04
Interstitial collagenase
(Homo sapiens (Human))
BDBM50098919
((R)-1-Isopropyl-4-(4-methoxy-benzenesulfonyl)-7-ox...)
Show SMILES COc1ccc(cc1)S(=O)(=O)N1CCN(C(C)C)C(=O)C[C@@H]1C(=O)NO
Show InChI InChI=1S/C16H23N3O6S/c1-11(2)18-8-9-19(14(10-15(18)20)16(21)17-22)26(23,24)13-6-4-12(25-3)5-7-13/h4-7,11,14,22H,8-10H2,1-3H3,(H,17,21)/t14-/m1/s1
Reactome pathway
n/an/a 22n/an/an/an/an/an/a
Procter and Gamble Pharmaceuticals
Curated by ChEMBL
Assay Description
Inhibition of human Matrix metalloprotease-1
Bioorg Med Chem Lett 11: 1009-13 (2001)
BindingDB Entry DOI: 10.7270/Q2X34Z04
Stromelysin-1
(Homo sapiens (Human))
BDBM50098919
((R)-1-Isopropyl-4-(4-methoxy-benzenesulfonyl)-7-ox...)
Show SMILES COc1ccc(cc1)S(=O)(=O)N1CCN(C(C)C)C(=O)C[C@@H]1C(=O)NO
Show InChI InChI=1S/C16H23N3O6S/c1-11(2)18-8-9-19(14(10-15(18)20)16(21)17-22)26(23,24)13-6-4-12(25-3)5-7-13/h4-7,11,14,22H,8-10H2,1-3H3,(H,17,21)/t14-/m1/s1
Reactome pathway
n/an/a 6.5n/an/an/an/an/an/a
Procter and Gamble Pharmaceuticals
Curated by ChEMBL
Assay Description
Inhibition of Matrix metalloprotease-3
Bioorg Med Chem Lett 11: 1009-13 (2001)
BindingDB Entry DOI: 10.7270/Q2X34Z04
Matrix metalloproteinase-9
(Homo sapiens (Human))
BDBM50098919
((R)-1-Isopropyl-4-(4-methoxy-benzenesulfonyl)-7-ox...)
Show SMILES COc1ccc(cc1)S(=O)(=O)N1CCN(C(C)C)C(=O)C[C@@H]1C(=O)NO
Show InChI InChI=1S/C16H23N3O6S/c1-11(2)18-8-9-19(14(10-15(18)20)16(21)17-22)26(23,24)13-6-4-12(25-3)5-7-13/h4-7,11,14,22H,8-10H2,1-3H3,(H,17,21)/t14-/m1/s1
Reactome pathway
n/an/a 4.10n/an/an/an/an/an/a
Procter and Gamble Pharmaceuticals
Curated by ChEMBL
Assay Description
Inhibition of Matrix metalloprotease-9
Bioorg Med Chem Lett 11: 1009-13 (2001)
BindingDB Entry DOI: 10.7270/Q2X34Z04
72 kDa type IV collagenase
(Homo sapiens (Human))
BDBM50098919
((R)-1-Isopropyl-4-(4-methoxy-benzenesulfonyl)-7-ox...)
Show SMILES COc1ccc(cc1)S(=O)(=O)N1CCN(C(C)C)C(=O)C[C@@H]1C(=O)NO
Show InChI InChI=1S/C16H23N3O6S/c1-11(2)18-8-9-19(14(10-15(18)20)16(21)17-22)26(23,24)13-6-4-12(25-3)5-7-13/h4-7,11,14,22H,8-10H2,1-3H3,(H,17,21)/t14-/m1/s1
Reactome pathway
n/an/a 2.40n/an/an/an/an/an/a
Procter and Gamble Pharmaceuticals
Curated by ChEMBL
Assay Description
Inhibition of human Matrix metalloprotease-2
Bioorg Med Chem Lett 11: 1009-13 (2001)
BindingDB Entry DOI: 10.7270/Q2X34Z04