BDBM50099135 1-{2-[2,3-Dichloro-4-(2-isopropyl-phenylsulfanyl)-phenyl]-cyclopropanecarbonyl}-piperidine-4-carboxylic acid::CHEMBL367084
SMILES: CC(C)c1ccccc1Sc1ccc(C2CC2C(=O)N2CCC(CC2)C(O)=O)c(Cl)c1Cl
InChI Key: InChIKey=MEMSOGHDJLMQDL-UHFFFAOYSA-N
Data: 2 IC50
Activity Spreadsheet -- Enzyme Inhibition Constant Data from BindingDB
Found 2 hits for monomerid = 50099135
Trg + Lig
Ki
nM
ΔG°
kcal/mole
IC50
nM
Kd
nM
EC50/IC50
nM
koff
s-1
kon
M-1s-1
pHTemp
°C
Integrin beta-2/Intercellular adhesion molecule-1 /Leukocyte adhesion glycoprotein LFA-1 alpha
(Homo sapiens (Human))
BDBM50099135
(1-{2-[2,3-Dichloro-4-(2-isopropyl-phenylsulfanyl)-...)
Show SMILES CC(C)c1ccccc1Sc1ccc(C2CC2C(=O)N2CCC(CC2)C(O)=O)c(Cl)c1Cl
Show InChI InChI=1S/C25H27Cl2NO3S/c1-14(2)16-5-3-4-6-20(16)32-21-8-7-17(22(26)23(21)27)18-13-19(18)24(29)28-11-9-15(10-12-28)25(30)31/h3-8,14-15,18-19H,9-13H2,1-2H3,(H,30,31)
n/an/a 9n/an/an/an/an/an/a
Abbott Laboratories
Curated by ChEMBL
Assay Description
Ability to block the adherence of leukocyte function-associated antigen-1 (LFA-1) expressing JY-8 cells and intercellular adhesion molecule (ICAM-1) ...
Bioorg Med Chem Lett 11: 973-6 (2001)
BindingDB Entry DOI: 10.7270/Q24T6HN4
Integrin beta-2/Intercellular adhesion molecule-1 /Leukocyte adhesion glycoprotein LFA-1 alpha
(Homo sapiens (Human))
BDBM50099135
(1-{2-[2,3-Dichloro-4-(2-isopropyl-phenylsulfanyl)-...)
Show SMILES CC(C)c1ccccc1Sc1ccc(C2CC2C(=O)N2CCC(CC2)C(O)=O)c(Cl)c1Cl
Show InChI InChI=1S/C25H27Cl2NO3S/c1-14(2)16-5-3-4-6-20(16)32-21-8-7-17(22(26)23(21)27)18-13-19(18)24(29)28-11-9-15(10-12-28)25(30)31/h3-8,14-15,18-19H,9-13H2,1-2H3,(H,30,31)
n/an/a 21n/an/an/an/an/an/a
Abbott Laboratories
Curated by ChEMBL
Assay Description
50% inhibition of JY-8 cell adhesion to ICAM-1 via leukocyte function-associated antigen-1 (LFA-1) with 50% FBS
Bioorg Med Chem Lett 11: 973-6 (2001)
BindingDB Entry DOI: 10.7270/Q24T6HN4