BDBM50099198 CHEMBL429531::Tyr-Pro-Ser-Lys-Pro-Asp-Asn-Pro-Gly-Glu-Asp-Ala-Pro-Ala-Glu-Asp-Leu-Ala-Arg-Tyr-Tyr-Ser-Ala-Leu-Arg-His-Tyr-Ile-Asn-Leu-Leu-Thr-Arg-Pro-Arg-Tyr
SMILES:
InChI Key: InChIKey=ZNBZLZXDILRJJT-CCPZSHQESA-N
Data: 4 KI  3 EC50
Activity Spreadsheet -- Enzyme Inhibition Constant Data from BindingDB
Found 7 hits for monomerid = 50099198
Trg + Lig
Ki
nM
ΔG°
kcal/mole
IC50
nM
Kd
nM
EC50/IC50
nM
koff
s-1
kon
M-1s-1
pHTemp
°C
PPYR1
(Homo sapiens (Human))
BDBM50099198
(CHEMBL429531 | Tyr-Pro-Ser-Lys-Pro-Asp-Asn-Pro-Gly...)
Show InChI InChI=1S/C190H286N54O56/c1-16-96(10)150(180(294)234-130(82-142(193)253)168(282)225-124(74-94(6)7)164(278)226-125(75-95(8)9)171(285)239-151(101(15)247)181(295)221-120(32-22-66-208-190(202)203)185(299)243-70-26-36-140(243)177(291)219-116(31-21-65-207-189(200)201)156(270)222-121(152(195)266)77-103-40-50-109(249)51-41-103)238-172(286)128(80-106-46-56-112(252)57-47-106)229-167(281)129(81-107-87-204-91-210-107)230-158(272)115(30-20-64-206-188(198)199)218-163(277)123(73-93(4)5)223-155(269)98(12)212-173(287)135(89-245)236-166(280)127(79-105-44-54-111(251)55-45-105)228-165(279)126(78-104-42-52-110(250)53-43-104)227-157(271)114(29-19-63-205-187(196)197)216-153(267)97(11)211-161(275)122(72-92(2)3)224-169(283)132(85-148(262)263)232-160(274)118(59-61-146(258)259)217-154(268)99(13)213-176(290)138-34-24-67-240(138)182(296)100(14)214-162(276)131(84-147(260)261)231-159(273)117(58-60-145(256)257)215-144(255)88-209-175(289)137-33-23-69-242(137)186(300)134(83-143(194)254)235-170(284)133(86-149(264)265)233-178(292)141-37-27-71-244(141)184(298)119(28-17-18-62-191)220-174(288)136(90-246)237-179(293)139-35-25-68-241(139)183(297)113(192)76-102-38-48-108(248)49-39-102/h38-57,87,91-101,113-141,150-151,245-252H,16-37,58-86,88-90,191-192H2,1-15H3,(H2,193,253)(H2,194,254)(H2,195,266)(H,204,210)(H,209,289)(H,211,275)(H,212,287)(H,213,290)(H,214,276)(H,215,255)(H,216,267)(H,217,268)(H,218,277)(H,219,291)(H,220,288)(H,221,295)(H,222,270)(H,223,269)(H,224,283)(H,225,282)(H,226,278)(H,227,271)(H,228,279)(H,229,281)(H,230,272)(H,231,273)(H,232,274)(H,233,292)(H,234,294)(H,235,284)(H,236,280)(H,237,293)(H,238,286)(H,239,285)(H,256,257)(H,258,259)(H,260,261)(H,262,263)(H,264,265)(H4,196,197,205)(H4,198,199,206)(H4,200,201,207)(H4,202,203,208)/t96-,97-,98-,99-,100-,101+,113-,114-,115-,116-,117-,118-,119-,120-,121-,122-,123-,124-,125-,126-,127-,128-,129-,130-,131-,132-,133-,134-,135-,136-,137-,138-,139-,140-,141-,150-,151-/m0/s1
Reactome pathway
0.0800n/an/an/an/an/an/an/an/a
University of Cincinnati and VA Medical Centers
Curated by ChEMBL
Assay Description
Affinity for cloned Y4 receptor using [125I]-PP as radioligand
J Med Chem 44: 1479-82 (2001)
BindingDB Entry DOI: 10.7270/Q2RJ4HRJ
Neuropeptide Y receptor type 2
(Homo sapiens (Human))
BDBM50099198
(CHEMBL429531 | Tyr-Pro-Ser-Lys-Pro-Asp-Asn-Pro-Gly...)
Show InChI InChI=1S/C190H286N54O56/c1-16-96(10)150(180(294)234-130(82-142(193)253)168(282)225-124(74-94(6)7)164(278)226-125(75-95(8)9)171(285)239-151(101(15)247)181(295)221-120(32-22-66-208-190(202)203)185(299)243-70-26-36-140(243)177(291)219-116(31-21-65-207-189(200)201)156(270)222-121(152(195)266)77-103-40-50-109(249)51-41-103)238-172(286)128(80-106-46-56-112(252)57-47-106)229-167(281)129(81-107-87-204-91-210-107)230-158(272)115(30-20-64-206-188(198)199)218-163(277)123(73-93(4)5)223-155(269)98(12)212-173(287)135(89-245)236-166(280)127(79-105-44-54-111(251)55-45-105)228-165(279)126(78-104-42-52-110(250)53-43-104)227-157(271)114(29-19-63-205-187(196)197)216-153(267)97(11)211-161(275)122(72-92(2)3)224-169(283)132(85-148(262)263)232-160(274)118(59-61-146(258)259)217-154(268)99(13)213-176(290)138-34-24-67-240(138)182(296)100(14)214-162(276)131(84-147(260)261)231-159(273)117(58-60-145(256)257)215-144(255)88-209-175(289)137-33-23-69-242(137)186(300)134(83-143(194)254)235-170(284)133(86-149(264)265)233-178(292)141-37-27-71-244(141)184(298)119(28-17-18-62-191)220-174(288)136(90-246)237-179(293)139-35-25-68-241(139)183(297)113(192)76-102-38-48-108(248)49-39-102/h38-57,87,91-101,113-141,150-151,245-252H,16-37,58-86,88-90,191-192H2,1-15H3,(H2,193,253)(H2,194,254)(H2,195,266)(H,204,210)(H,209,289)(H,211,275)(H,212,287)(H,213,290)(H,214,276)(H,215,255)(H,216,267)(H,217,268)(H,218,277)(H,219,291)(H,220,288)(H,221,295)(H,222,270)(H,223,269)(H,224,283)(H,225,282)(H,226,278)(H,227,271)(H,228,279)(H,229,281)(H,230,272)(H,231,273)(H,232,274)(H,233,292)(H,234,294)(H,235,284)(H,236,280)(H,237,293)(H,238,286)(H,239,285)(H,256,257)(H,258,259)(H,260,261)(H,262,263)(H,264,265)(H4,196,197,205)(H4,198,199,206)(H4,200,201,207)(H4,202,203,208)/t96-,97-,98-,99-,100-,101+,113-,114-,115-,116-,117-,118-,119-,120-,121-,122-,123-,124-,125-,126-,127-,128-,129-,130-,131-,132-,133-,134-,135-,136-,137-,138-,139-,140-,141-,150-,151-/m0/s1
Reactome pathway
0.230n/an/an/an/an/an/an/an/a
University of Cincinnati and VA Medical Centers
Curated by ChEMBL
Assay Description
Affinity for cloned Y2 receptor using [125I]-PYY as radioligand
J Med Chem 44: 1479-82 (2001)
BindingDB Entry DOI: 10.7270/Q2RJ4HRJ
Neuropeptide Y receptor type 1
(Homo sapiens (Human))
BDBM50099198
(CHEMBL429531 | Tyr-Pro-Ser-Lys-Pro-Asp-Asn-Pro-Gly...)
Show InChI InChI=1S/C190H286N54O56/c1-16-96(10)150(180(294)234-130(82-142(193)253)168(282)225-124(74-94(6)7)164(278)226-125(75-95(8)9)171(285)239-151(101(15)247)181(295)221-120(32-22-66-208-190(202)203)185(299)243-70-26-36-140(243)177(291)219-116(31-21-65-207-189(200)201)156(270)222-121(152(195)266)77-103-40-50-109(249)51-41-103)238-172(286)128(80-106-46-56-112(252)57-47-106)229-167(281)129(81-107-87-204-91-210-107)230-158(272)115(30-20-64-206-188(198)199)218-163(277)123(73-93(4)5)223-155(269)98(12)212-173(287)135(89-245)236-166(280)127(79-105-44-54-111(251)55-45-105)228-165(279)126(78-104-42-52-110(250)53-43-104)227-157(271)114(29-19-63-205-187(196)197)216-153(267)97(11)211-161(275)122(72-92(2)3)224-169(283)132(85-148(262)263)232-160(274)118(59-61-146(258)259)217-154(268)99(13)213-176(290)138-34-24-67-240(138)182(296)100(14)214-162(276)131(84-147(260)261)231-159(273)117(58-60-145(256)257)215-144(255)88-209-175(289)137-33-23-69-242(137)186(300)134(83-143(194)254)235-170(284)133(86-149(264)265)233-178(292)141-37-27-71-244(141)184(298)119(28-17-18-62-191)220-174(288)136(90-246)237-179(293)139-35-25-68-241(139)183(297)113(192)76-102-38-48-108(248)49-39-102/h38-57,87,91-101,113-141,150-151,245-252H,16-37,58-86,88-90,191-192H2,1-15H3,(H2,193,253)(H2,194,254)(H2,195,266)(H,204,210)(H,209,289)(H,211,275)(H,212,287)(H,213,290)(H,214,276)(H,215,255)(H,216,267)(H,217,268)(H,218,277)(H,219,291)(H,220,288)(H,221,295)(H,222,270)(H,223,269)(H,224,283)(H,225,282)(H,226,278)(H,227,271)(H,228,279)(H,229,281)(H,230,272)(H,231,273)(H,232,274)(H,233,292)(H,234,294)(H,235,284)(H,236,280)(H,237,293)(H,238,286)(H,239,285)(H,256,257)(H,258,259)(H,260,261)(H,262,263)(H,264,265)(H4,196,197,205)(H4,198,199,206)(H4,200,201,207)(H4,202,203,208)/t96-,97-,98-,99-,100-,101+,113-,114-,115-,116-,117-,118-,119-,120-,121-,122-,123-,124-,125-,126-,127-,128-,129-,130-,131-,132-,133-,134-,135-,136-,137-,138-,139-,140-,141-,150-,151-/m0/s1
Reactome pathway
0.520n/an/an/an/an/an/an/an/a
University of Cincinnati and VA Medical Centers
Curated by ChEMBL
Assay Description
Affinity for cloned Y1 receptor using [125I]-PYY as radioligand
J Med Chem 44: 1479-82 (2001)
BindingDB Entry DOI: 10.7270/Q2RJ4HRJ
Neuropeptide Y receptor type 5 ( NPY Y5)
(Homo sapiens (Human))
BDBM50099198
(CHEMBL429531 | Tyr-Pro-Ser-Lys-Pro-Asp-Asn-Pro-Gly...)
Show InChI InChI=1S/C190H286N54O56/c1-16-96(10)150(180(294)234-130(82-142(193)253)168(282)225-124(74-94(6)7)164(278)226-125(75-95(8)9)171(285)239-151(101(15)247)181(295)221-120(32-22-66-208-190(202)203)185(299)243-70-26-36-140(243)177(291)219-116(31-21-65-207-189(200)201)156(270)222-121(152(195)266)77-103-40-50-109(249)51-41-103)238-172(286)128(80-106-46-56-112(252)57-47-106)229-167(281)129(81-107-87-204-91-210-107)230-158(272)115(30-20-64-206-188(198)199)218-163(277)123(73-93(4)5)223-155(269)98(12)212-173(287)135(89-245)236-166(280)127(79-105-44-54-111(251)55-45-105)228-165(279)126(78-104-42-52-110(250)53-43-104)227-157(271)114(29-19-63-205-187(196)197)216-153(267)97(11)211-161(275)122(72-92(2)3)224-169(283)132(85-148(262)263)232-160(274)118(59-61-146(258)259)217-154(268)99(13)213-176(290)138-34-24-67-240(138)182(296)100(14)214-162(276)131(84-147(260)261)231-159(273)117(58-60-145(256)257)215-144(255)88-209-175(289)137-33-23-69-242(137)186(300)134(83-143(194)254)235-170(284)133(86-149(264)265)233-178(292)141-37-27-71-244(141)184(298)119(28-17-18-62-191)220-174(288)136(90-246)237-179(293)139-35-25-68-241(139)183(297)113(192)76-102-38-48-108(248)49-39-102/h38-57,87,91-101,113-141,150-151,245-252H,16-37,58-86,88-90,191-192H2,1-15H3,(H2,193,253)(H2,194,254)(H2,195,266)(H,204,210)(H,209,289)(H,211,275)(H,212,287)(H,213,290)(H,214,276)(H,215,255)(H,216,267)(H,217,268)(H,218,277)(H,219,291)(H,220,288)(H,221,295)(H,222,270)(H,223,269)(H,224,283)(H,225,282)(H,226,278)(H,227,271)(H,228,279)(H,229,281)(H,230,272)(H,231,273)(H,232,274)(H,233,292)(H,234,294)(H,235,284)(H,236,280)(H,237,293)(H,238,286)(H,239,285)(H,256,257)(H,258,259)(H,260,261)(H,262,263)(H,264,265)(H4,196,197,205)(H4,198,199,206)(H4,200,201,207)(H4,202,203,208)/t96-,97-,98-,99-,100-,101+,113-,114-,115-,116-,117-,118-,119-,120-,121-,122-,123-,124-,125-,126-,127-,128-,129-,130-,131-,132-,133-,134-,135-,136-,137-,138-,139-,140-,141-,150-,151-/m0/s1
2.21n/an/an/an/an/an/an/an/a
University of Cincinnati and VA Medical Centers
Curated by ChEMBL
Assay Description
Affinity for cloned Y5 receptor using [125I]-PYY as radioligand
J Med Chem 44: 1479-82 (2001)
BindingDB Entry DOI: 10.7270/Q2RJ4HRJ
PPYR1
(Homo sapiens (Human))
BDBM50099198
(CHEMBL429531 | Tyr-Pro-Ser-Lys-Pro-Asp-Asn-Pro-Gly...)
Show InChI InChI=1S/C190H286N54O56/c1-16-96(10)150(180(294)234-130(82-142(193)253)168(282)225-124(74-94(6)7)164(278)226-125(75-95(8)9)171(285)239-151(101(15)247)181(295)221-120(32-22-66-208-190(202)203)185(299)243-70-26-36-140(243)177(291)219-116(31-21-65-207-189(200)201)156(270)222-121(152(195)266)77-103-40-50-109(249)51-41-103)238-172(286)128(80-106-46-56-112(252)57-47-106)229-167(281)129(81-107-87-204-91-210-107)230-158(272)115(30-20-64-206-188(198)199)218-163(277)123(73-93(4)5)223-155(269)98(12)212-173(287)135(89-245)236-166(280)127(79-105-44-54-111(251)55-45-105)228-165(279)126(78-104-42-52-110(250)53-43-104)227-157(271)114(29-19-63-205-187(196)197)216-153(267)97(11)211-161(275)122(72-92(2)3)224-169(283)132(85-148(262)263)232-160(274)118(59-61-146(258)259)217-154(268)99(13)213-176(290)138-34-24-67-240(138)182(296)100(14)214-162(276)131(84-147(260)261)231-159(273)117(58-60-145(256)257)215-144(255)88-209-175(289)137-33-23-69-242(137)186(300)134(83-143(194)254)235-170(284)133(86-149(264)265)233-178(292)141-37-27-71-244(141)184(298)119(28-17-18-62-191)220-174(288)136(90-246)237-179(293)139-35-25-68-241(139)183(297)113(192)76-102-38-48-108(248)49-39-102/h38-57,87,91-101,113-141,150-151,245-252H,16-37,58-86,88-90,191-192H2,1-15H3,(H2,193,253)(H2,194,254)(H2,195,266)(H,204,210)(H,209,289)(H,211,275)(H,212,287)(H,213,290)(H,214,276)(H,215,255)(H,216,267)(H,217,268)(H,218,277)(H,219,291)(H,220,288)(H,221,295)(H,222,270)(H,223,269)(H,224,283)(H,225,282)(H,226,278)(H,227,271)(H,228,279)(H,229,281)(H,230,272)(H,231,273)(H,232,274)(H,233,292)(H,234,294)(H,235,284)(H,236,280)(H,237,293)(H,238,286)(H,239,285)(H,256,257)(H,258,259)(H,260,261)(H,262,263)(H,264,265)(H4,196,197,205)(H4,198,199,206)(H4,200,201,207)(H4,202,203,208)/t96-,97-,98-,99-,100-,101+,113-,114-,115-,116-,117-,118-,119-,120-,121-,122-,123-,124-,125-,126-,127-,128-,129-,130-,131-,132-,133-,134-,135-,136-,137-,138-,139-,140-,141-,150-,151-/m0/s1
Reactome pathway
n/an/an/an/a 0.460n/an/an/an/a
University of Cincinnati and VA Medical Centers
Curated by ChEMBL
Assay Description
Agonist potency for the inhibition of Forskolin stimulated cAMP synthesis in cells expressing cloned Y2 receptors
J Med Chem 44: 1479-82 (2001)
BindingDB Entry DOI: 10.7270/Q2RJ4HRJ
Neuropeptide Y receptor type 5 ( NPY Y5)
(Homo sapiens (Human))
BDBM50099198
(CHEMBL429531 | Tyr-Pro-Ser-Lys-Pro-Asp-Asn-Pro-Gly...)
Show InChI InChI=1S/C190H286N54O56/c1-16-96(10)150(180(294)234-130(82-142(193)253)168(282)225-124(74-94(6)7)164(278)226-125(75-95(8)9)171(285)239-151(101(15)247)181(295)221-120(32-22-66-208-190(202)203)185(299)243-70-26-36-140(243)177(291)219-116(31-21-65-207-189(200)201)156(270)222-121(152(195)266)77-103-40-50-109(249)51-41-103)238-172(286)128(80-106-46-56-112(252)57-47-106)229-167(281)129(81-107-87-204-91-210-107)230-158(272)115(30-20-64-206-188(198)199)218-163(277)123(73-93(4)5)223-155(269)98(12)212-173(287)135(89-245)236-166(280)127(79-105-44-54-111(251)55-45-105)228-165(279)126(78-104-42-52-110(250)53-43-104)227-157(271)114(29-19-63-205-187(196)197)216-153(267)97(11)211-161(275)122(72-92(2)3)224-169(283)132(85-148(262)263)232-160(274)118(59-61-146(258)259)217-154(268)99(13)213-176(290)138-34-24-67-240(138)182(296)100(14)214-162(276)131(84-147(260)261)231-159(273)117(58-60-145(256)257)215-144(255)88-209-175(289)137-33-23-69-242(137)186(300)134(83-143(194)254)235-170(284)133(86-149(264)265)233-178(292)141-37-27-71-244(141)184(298)119(28-17-18-62-191)220-174(288)136(90-246)237-179(293)139-35-25-68-241(139)183(297)113(192)76-102-38-48-108(248)49-39-102/h38-57,87,91-101,113-141,150-151,245-252H,16-37,58-86,88-90,191-192H2,1-15H3,(H2,193,253)(H2,194,254)(H2,195,266)(H,204,210)(H,209,289)(H,211,275)(H,212,287)(H,213,290)(H,214,276)(H,215,255)(H,216,267)(H,217,268)(H,218,277)(H,219,291)(H,220,288)(H,221,295)(H,222,270)(H,223,269)(H,224,283)(H,225,282)(H,226,278)(H,227,271)(H,228,279)(H,229,281)(H,230,272)(H,231,273)(H,232,274)(H,233,292)(H,234,294)(H,235,284)(H,236,280)(H,237,293)(H,238,286)(H,239,285)(H,256,257)(H,258,259)(H,260,261)(H,262,263)(H,264,265)(H4,196,197,205)(H4,198,199,206)(H4,200,201,207)(H4,202,203,208)/t96-,97-,98-,99-,100-,101+,113-,114-,115-,116-,117-,118-,119-,120-,121-,122-,123-,124-,125-,126-,127-,128-,129-,130-,131-,132-,133-,134-,135-,136-,137-,138-,139-,140-,141-,150-,151-/m0/s1
n/an/an/an/a 7.89n/an/an/an/a
University of Cincinnati and VA Medical Centers
Curated by ChEMBL
Assay Description
Agonist potency for the inhibition of Forskolin stimulated cAMP synthesis in cells expressing cloned Y5 receptors
J Med Chem 44: 1479-82 (2001)
BindingDB Entry DOI: 10.7270/Q2RJ4HRJ
PPYR1
(Homo sapiens (Human))
BDBM50099198
(CHEMBL429531 | Tyr-Pro-Ser-Lys-Pro-Asp-Asn-Pro-Gly...)
Show InChI InChI=1S/C190H286N54O56/c1-16-96(10)150(180(294)234-130(82-142(193)253)168(282)225-124(74-94(6)7)164(278)226-125(75-95(8)9)171(285)239-151(101(15)247)181(295)221-120(32-22-66-208-190(202)203)185(299)243-70-26-36-140(243)177(291)219-116(31-21-65-207-189(200)201)156(270)222-121(152(195)266)77-103-40-50-109(249)51-41-103)238-172(286)128(80-106-46-56-112(252)57-47-106)229-167(281)129(81-107-87-204-91-210-107)230-158(272)115(30-20-64-206-188(198)199)218-163(277)123(73-93(4)5)223-155(269)98(12)212-173(287)135(89-245)236-166(280)127(79-105-44-54-111(251)55-45-105)228-165(279)126(78-104-42-52-110(250)53-43-104)227-157(271)114(29-19-63-205-187(196)197)216-153(267)97(11)211-161(275)122(72-92(2)3)224-169(283)132(85-148(262)263)232-160(274)118(59-61-146(258)259)217-154(268)99(13)213-176(290)138-34-24-67-240(138)182(296)100(14)214-162(276)131(84-147(260)261)231-159(273)117(58-60-145(256)257)215-144(255)88-209-175(289)137-33-23-69-242(137)186(300)134(83-143(194)254)235-170(284)133(86-149(264)265)233-178(292)141-37-27-71-244(141)184(298)119(28-17-18-62-191)220-174(288)136(90-246)237-179(293)139-35-25-68-241(139)183(297)113(192)76-102-38-48-108(248)49-39-102/h38-57,87,91-101,113-141,150-151,245-252H,16-37,58-86,88-90,191-192H2,1-15H3,(H2,193,253)(H2,194,254)(H2,195,266)(H,204,210)(H,209,289)(H,211,275)(H,212,287)(H,213,290)(H,214,276)(H,215,255)(H,216,267)(H,217,268)(H,218,277)(H,219,291)(H,220,288)(H,221,295)(H,222,270)(H,223,269)(H,224,283)(H,225,282)(H,226,278)(H,227,271)(H,228,279)(H,229,281)(H,230,272)(H,231,273)(H,232,274)(H,233,292)(H,234,294)(H,235,284)(H,236,280)(H,237,293)(H,238,286)(H,239,285)(H,256,257)(H,258,259)(H,260,261)(H,262,263)(H,264,265)(H4,196,197,205)(H4,198,199,206)(H4,200,201,207)(H4,202,203,208)/t96-,97-,98-,99-,100-,101+,113-,114-,115-,116-,117-,118-,119-,120-,121-,122-,123-,124-,125-,126-,127-,128-,129-,130-,131-,132-,133-,134-,135-,136-,137-,138-,139-,140-,141-,150-,151-/m0/s1
Reactome pathway
n/an/an/an/a 0.160n/an/an/an/a
University of Cincinnati and VA Medical Centers
Curated by ChEMBL
Assay Description
Agonist potency for the inhibition of Forskolin stimulated cAMP synthesis in cells expressing cloned Y4 receptors
J Med Chem 44: 1479-82 (2001)
BindingDB Entry DOI: 10.7270/Q2RJ4HRJ