BDBM50099410 CHEMBL3342849
SMILES: CC(C)C(=O)NCc1ccc(Cl)c(c1)-c1nc2cc(ncc2c(=O)[nH]1)-c1ccc(cc1)C(F)(F)F
InChI Key: InChIKey=SXZOHBBSSIEDDY-UHFFFAOYSA-N
Data: 4 IC50
Activity Spreadsheet -- Enzyme Inhibition Constant Data from BindingDB
Found 4 hits for monomerid = 50099410
Trg + Lig
Ki
nM
ΔG°
kcal/mole
IC50
nM
Kd
nM
EC50/IC50
nM
koff
s-1
kon
M-1s-1
pHTemp
°C
Prostaglandin E synthase
(Homo sapiens (Human))
BDBM50099410
(CHEMBL3342849)
Show SMILES CC(C)C(=O)NCc1ccc(Cl)c(c1)-c1nc2cc(ncc2c(=O)[nH]1)-c1ccc(cc1)C(F)(F)F
Show InChI InChI=1S/C25H20ClF3N4O2/c1-13(2)23(34)31-11-14-3-8-19(26)17(9-14)22-32-21-10-20(30-12-18(21)24(35)33-22)15-4-6-16(7-5-15)25(27,28)29/h3-10,12-13H,11H2,1-2H3,(H,31,34)(H,32,33,35)
Reactome pathway
n/an/a 376n/an/an/an/an/an/a
Glenmark Pharmaceuticals Limited
Curated by ChEMBL
Assay Description
Inhibition of human recombinant mPGES-1 using PGH2 as substrate incubated for 25 mins prior to substrate addition measured after 1 min by HTRF method
Bioorg Med Chem Lett 24: 4838-44 (2014)
Article DOI: 10.1016/j.bmcl.2014.08.056
BindingDB Entry DOI: 10.7270/Q2X068MN
Prostaglandin E synthase
(Homo sapiens (Human))
BDBM50099410
(CHEMBL3342849)
Show SMILES CC(C)C(=O)NCc1ccc(Cl)c(c1)-c1nc2cc(ncc2c(=O)[nH]1)-c1ccc(cc1)C(F)(F)F
Show InChI InChI=1S/C25H20ClF3N4O2/c1-13(2)23(34)31-11-14-3-8-19(26)17(9-14)22-32-21-10-20(30-12-18(21)24(35)33-22)15-4-6-16(7-5-15)25(27,28)29/h3-10,12-13H,11H2,1-2H3,(H,31,34)(H,32,33,35)
Reactome pathway
n/an/a 5n/an/an/an/an/an/a
Glenmark Pharmaceuticals Limited
Curated by ChEMBL
Assay Description
Inhibition of human recombinant mPGES-1 expressed in CHO cells using PGH2 as substrate incubated for 10 mins prior to substrate addition measured aft...
Bioorg Med Chem Lett 24: 4838-44 (2014)
Article DOI: 10.1016/j.bmcl.2014.08.056
BindingDB Entry DOI: 10.7270/Q2X068MN
Prostaglandin E synthase
(Homo sapiens (Human))
BDBM50099410
(CHEMBL3342849)
Show SMILES CC(C)C(=O)NCc1ccc(Cl)c(c1)-c1nc2cc(ncc2c(=O)[nH]1)-c1ccc(cc1)C(F)(F)F
Show InChI InChI=1S/C25H20ClF3N4O2/c1-13(2)23(34)31-11-14-3-8-19(26)17(9-14)22-32-21-10-20(30-12-18(21)24(35)33-22)15-4-6-16(7-5-15)25(27,28)29/h3-10,12-13H,11H2,1-2H3,(H,31,34)(H,32,33,35)
Reactome pathway
n/an/a 5n/an/an/an/an/an/a
Glenmark Pharmaceuticals Limited
Curated by ChEMBL
Assay Description
Inhibition of mPGES-1 in human A549 cells assessed as inhibition of IL-1beta-induced PGE2 production incubated for 30 mins prior to IL-1beta challeng...
Bioorg Med Chem Lett 24: 4838-44 (2014)
Article DOI: 10.1016/j.bmcl.2014.08.056
BindingDB Entry DOI: 10.7270/Q2X068MN
Prostaglandin E synthase
(Canis familiaris)
BDBM50099410
(CHEMBL3342849)
Show SMILES CC(C)C(=O)NCc1ccc(Cl)c(c1)-c1nc2cc(ncc2c(=O)[nH]1)-c1ccc(cc1)C(F)(F)F
Show InChI InChI=1S/C25H20ClF3N4O2/c1-13(2)23(34)31-11-14-3-8-19(26)17(9-14)22-32-21-10-20(30-12-18(21)24(35)33-22)15-4-6-16(7-5-15)25(27,28)29/h3-10,12-13H,11H2,1-2H3,(H,31,34)(H,32,33,35)
n/an/a 154n/an/an/an/an/an/a
Glenmark Pharmaceuticals Limited
Curated by ChEMBL
Assay Description
Inhibition of human recombinant mPGES-1 expressed in CHO cells using PGH2 as substrate incubated for 10 mins prior to substrate addition measured aft...
Bioorg Med Chem Lett 24: 4838-44 (2014)
Article DOI: 10.1016/j.bmcl.2014.08.056
BindingDB Entry DOI: 10.7270/Q2X068MN