BDBM50099513 1-(4-Benzyl-4-hydroxy-piperidin-1-yl)-3-[2-(4-chloro-phenyl)-1-methyl-5-pyridin-2-yl-1H-indol-3-yl]-propan-1-one::CHEMBL20717
SMILES: Cn1c(c(CCC(=O)N2CCC(O)(Cc3ccccc3)CC2)c2cc(ccc12)-c1ccccn1)-c1ccc(Cl)cc1
InChI Key: InChIKey=UVKFZSYMLITLDR-UHFFFAOYSA-N
Data: 1 IC50
Activity Spreadsheet -- Enzyme Inhibition Constant Data from BindingDB
Found 1 hit for monomerid = 50099513
Trg + Lig
Ki
nM
ΔG°
kcal/mole
IC50
nM
Kd
nM
EC50/IC50
nM
koff
s-1
kon
M-1s-1
pHTemp
°C
Neurokinin 1 receptor
(Homo sapiens (Human))
BDBM50099513
(1-(4-Benzyl-4-hydroxy-piperidin-1-yl)-3-[2-(4-chlo...)
Show SMILES Cn1c(c(CCC(=O)N2CCC(O)(Cc3ccccc3)CC2)c2cc(ccc12)-c1ccccn1)-c1ccc(Cl)cc1
Show InChI InChI=1S/C35H34ClN3O2/c1-38-32-16-12-27(31-9-5-6-20-37-31)23-30(32)29(34(38)26-10-13-28(36)14-11-26)15-17-33(40)39-21-18-35(41,19-22-39)24-25-7-3-2-4-8-25/h2-14,16,20,23,41H,15,17-19,21-22,24H2,1H3
Reactome pathway
n/an/a 1.70n/an/an/an/an/an/a
The Neuroscience Research Centre
Curated by ChEMBL
Assay Description
Concentration required for displacement of [125I]-labeled substance P from cloned hNK1 receptor expressed in CHO cells
Bioorg Med Chem Lett 11: 1233-6 (2001)
BindingDB Entry DOI: 10.7270/Q2PK0FDF