BDBM50099522 1-(4-Benzyl-4-hydroxy-piperidin-1-yl)-3-[5-chloro-2-(4-chloro-phenyl)-1-methyl-1H-pyrrolo[3,2-b]pyridin-3-yl]-propan-1-one::CHEMBL21662
SMILES: Cn1c(c(CCC(=O)N2CCC(O)(Cc3ccccc3)CC2)c2nc(Cl)ccc12)-c1ccc(Cl)cc1
InChI Key: InChIKey=ZJVDJQRDIOJIMX-UHFFFAOYSA-N
Data: 1 IC50
Activity Spreadsheet -- Enzyme Inhibition Constant Data from BindingDB
Found 1 hit for monomerid = 50099522
Trg + Lig
Ki
nM
ΔG°
kcal/mole
IC50
nM
Kd
nM
EC50/IC50
nM
koff
s-1
kon
M-1s-1
pHTemp
°C
Neurokinin 1 receptor
(Homo sapiens (Human))
BDBM50099522
(1-(4-Benzyl-4-hydroxy-piperidin-1-yl)-3-[5-chloro-...)
Show SMILES Cn1c(c(CCC(=O)N2CCC(O)(Cc3ccccc3)CC2)c2nc(Cl)ccc12)-c1ccc(Cl)cc1
Show InChI InChI=1S/C29H29Cl2N3O2/c1-33-24-12-13-25(31)32-27(24)23(28(33)21-7-9-22(30)10-8-21)11-14-26(35)34-17-15-29(36,16-18-34)19-20-5-3-2-4-6-20/h2-10,12-13,36H,11,14-19H2,1H3
Reactome pathway
n/an/a 2.60n/an/an/an/an/an/a
The Neuroscience Research Centre
Curated by ChEMBL
Assay Description
Concentration required for displacement of [125I]-labeled substance P from cloned hNK1 receptor expressed in CHO cells
Bioorg Med Chem Lett 11: 1233-6 (2001)
BindingDB Entry DOI: 10.7270/Q2PK0FDF