null
SMILES: [H][C@@]12CC[C@@]3(C)[C@@H](C[C@H](OC(C)=O)C(=O)[C@]3([H])[C@@]1(C)C[C@H](OC2=O)c1ccoc1-c1ccccc1N)C(=O)OC
InChI Key: InChIKey=HUOSYUPHGYSPIM-LYQANMFSSA-N
Activity Spreadsheet -- Enzyme Inhibition Constant Data from BindingDB
Found 1 hit for monomerid = 50099648
Trg + Lig
Ki
nM
ΔG°
kcal/mole
IC50
nM
Kd
nM
EC50/IC50
nM
koff
s-1
kon
M-1s-1
pHTemp
°C
Kappa-type opioid receptor
(Homo sapiens (Human))
BDBM50099648
(CHEMBL3359806)
Show SMILES [H][C@@]12CC[C@@]3(C)[C@@H](C[C@H](OC(C)=O)C(=O)[C@]3([H])[C@@]1(C)C[C@H](OC2=O)c1ccoc1-c1ccccc1N)C(=O)OC |r|
Show InChI InChI=1S/C29H33NO8/c1-15(31)37-21-13-19(26(33)35-4)28(2)11-9-18-27(34)38-22(14-29(18,3)25(28)23(21)32)17-10-12-36-24(17)16-7-5-6-8-20(16)30/h5-8,10,12,18-19,21-22,25H,9,11,13-14,30H2,1-4H3/t18-,19-,21-,22-,25-,28-,29-/m0/s1
Reactome pathway
n/an/an/an/a 430n/an/an/an/a
The University of Kansas
Curated by ChEMBL
Assay Description
Agonist activity at human KOR expressed in CHO cells assessed as inhibition of forskolin-induced cAMP accumulation after 30 mins by luminescence assa...
J Med Chem 57: 10464-75 (2014)
Article DOI: 10.1021/jm501521d
BindingDB Entry DOI: 10.7270/Q2J38V6P