BDBM50099957 CHEMBL3321871
SMILES: CN1CCN(CC1)c1ccc2nc(Nc3ccc(Br)cn3)[nH]c2c1
InChI Key: InChIKey=WFMXQZLKABRSKQ-UHFFFAOYSA-N
Data: 1 IC50
Activity Spreadsheet -- Enzyme Inhibition Constant Data from BindingDB
Found 1 hit for monomerid = 50099957
Trg + Lig
Ki
nM
ΔG°
kcal/mole
IC50
nM
Kd
nM
EC50/IC50
nM
koff
s-1
kon
M-1s-1
pHTemp
°C
Potassium voltage-gated channel subfamily H member 2
(Homo sapiens (Human))
BDBM50099957
(CHEMBL3321871)
Show SMILES CN1CCN(CC1)c1ccc2nc(Nc3ccc(Br)cn3)[nH]c2c1
Show InChI InChI=1S/C17H19BrN6/c1-23-6-8-24(9-7-23)13-3-4-14-15(10-13)21-17(20-14)22-16-5-2-12(18)11-19-16/h2-5,10-11H,6-9H2,1H3,(H2,19,20,21,22)
Reactome pathway
n/an/a 3.50E+3n/an/an/an/an/an/a
AstraZeneca
Curated by ChEMBL
Assay Description
Inhibition of human ERG
J Med Chem 57: 6642-52 (2014)
Article DOI: 10.1021/jm500715u
BindingDB Entry DOI: 10.7270/Q2377BG1