BDBM50099985 4-(4-Cyclohexylsulfanyl-phenylamino)-6-methoxy-7-(3-morpholin-4-yl-propoxy)-quinoline-3-carbonitrile::CHEMBL282361
SMILES: COc1cc2c(Nc3ccc(SC4CCCCC4)cc3)c(cnc2cc1OCCCN1CCOCC1)C#N
InChI Key: InChIKey=NXNMTQRGGFOOML-UHFFFAOYSA-N
Data: 2 IC50
Activity Spreadsheet -- Enzyme Inhibition Constant Data from BindingDB
Found 2 hits for monomerid = 50099985
Trg + Lig
Ki
nM
ΔG°
kcal/mole
IC50
nM
Kd
nM
EC50/IC50
nM
koff
s-1
kon
M-1s-1
pHTemp
°C
Dual specificity mitogen-activated protein kinase kinase 1/Mitogen-activated protein kinase 1/RAF proto-oncogene serine/threonine-protein kinase
(Homo sapiens (Human))
BDBM50099985
(4-(4-Cyclohexylsulfanyl-phenylamino)-6-methoxy-7-(...)
Show SMILES COc1cc2c(Nc3ccc(SC4CCCCC4)cc3)c(cnc2cc1OCCCN1CCOCC1)C#N
Show InChI InChI=1S/C30H36N4O3S/c1-35-28-18-26-27(19-29(28)37-15-5-12-34-13-16-36-17-14-34)32-21-22(20-31)30(26)33-23-8-10-25(11-9-23)38-24-6-3-2-4-7-24/h8-11,18-19,21,24H,2-7,12-17H2,1H3,(H,32,33)
Reactome pathway
n/an/a 21n/an/an/an/an/an/a
Wyeth-Ayerst Research
Curated by ChEMBL
Assay Description
Inhibitory activity against Dual specificity mitogen-activated protein kinase kinase using direct MEK assay (which by-passes the need for activated R...
Bioorg Med Chem Lett 11: 1407-10 (2001)
BindingDB Entry DOI: 10.7270/Q2RB73WF
Dual specificity mitogen-activated protein kinase kinase 1
(Homo sapiens (Human))
BDBM50099985
(4-(4-Cyclohexylsulfanyl-phenylamino)-6-methoxy-7-(...)
Show SMILES COc1cc2c(Nc3ccc(SC4CCCCC4)cc3)c(cnc2cc1OCCCN1CCOCC1)C#N
Show InChI InChI=1S/C30H36N4O3S/c1-35-28-18-26-27(19-29(28)37-15-5-12-34-13-16-36-17-14-34)32-21-22(20-31)30(26)33-23-8-10-25(11-9-23)38-24-6-3-2-4-7-24/h8-11,18-19,21,24H,2-7,12-17H2,1H3,(H,32,33)
Reactome pathway
n/an/a 300n/an/an/an/an/an/a
Wyeth-Ayerst Research
Curated by ChEMBL
Assay Description
Inhibitory activity against Dual specificity mitogen-activated protein kinase kinase using direct MEK assay (which by-passes the need for activated R...
Bioorg Med Chem Lett 11: 1407-10 (2001)
BindingDB Entry DOI: 10.7270/Q2RB73WF