BDBM50099991 6-Methoxy-7-(3-morpholin-4-yl-propoxy)-4-(4-phenethyl-phenylamino)-quinoline-3-carbonitrile::CHEMBL30551
SMILES: COc1cc2c(Nc3ccc(CCc4ccccc4)cc3)c(cnc2cc1OCCCN1CCOCC1)C#N
InChI Key: InChIKey=UDXWFLNFPZDWSV-UHFFFAOYSA-N
Data: 2 IC50
Activity Spreadsheet -- Enzyme Inhibition Constant Data from BindingDB
Found 2 hits for monomerid = 50099991
Trg + Lig
Ki
nM
ΔG°
kcal/mole
IC50
nM
Kd
nM
EC50/IC50
nM
koff
s-1
kon
M-1s-1
pHTemp
°C
Dual specificity mitogen-activated protein kinase kinase 1/Mitogen-activated protein kinase 1/RAF proto-oncogene serine/threonine-protein kinase
(Homo sapiens (Human))
BDBM50099991
(6-Methoxy-7-(3-morpholin-4-yl-propoxy)-4-(4-phenet...)
Show SMILES COc1cc2c(Nc3ccc(CCc4ccccc4)cc3)c(cnc2cc1OCCCN1CCOCC1)C#N
Show InChI InChI=1S/C32H34N4O3/c1-37-30-20-28-29(21-31(30)39-17-5-14-36-15-18-38-19-16-36)34-23-26(22-33)32(28)35-27-12-10-25(11-13-27)9-8-24-6-3-2-4-7-24/h2-4,6-7,10-13,20-21,23H,5,8-9,14-19H2,1H3,(H,34,35)
Reactome pathway
n/an/a 150n/an/an/an/an/an/a
Wyeth-Ayerst Research
Curated by ChEMBL
Assay Description
Inhibitory activity against Dual specificity mitogen-activated protein kinase kinase using direct MEK assay (which by-passes the need for activated R...
Bioorg Med Chem Lett 11: 1407-10 (2001)
BindingDB Entry DOI: 10.7270/Q2RB73WF
Dual specificity mitogen-activated protein kinase kinase 1
(Homo sapiens (Human))
BDBM50099991
(6-Methoxy-7-(3-morpholin-4-yl-propoxy)-4-(4-phenet...)
Show SMILES COc1cc2c(Nc3ccc(CCc4ccccc4)cc3)c(cnc2cc1OCCCN1CCOCC1)C#N
Show InChI InChI=1S/C32H34N4O3/c1-37-30-20-28-29(21-31(30)39-17-5-14-36-15-18-38-19-16-36)34-23-26(22-33)32(28)35-27-12-10-25(11-13-27)9-8-24-6-3-2-4-7-24/h2-4,6-7,10-13,20-21,23H,5,8-9,14-19H2,1H3,(H,34,35)
Reactome pathway
n/an/a 33n/an/an/an/an/an/a
Wyeth-Ayerst Research
Curated by ChEMBL
Assay Description
Inhibition of Dual specificity mitogen-activated protein kinase kinase in coupled activated Raf/MEK assay
Bioorg Med Chem Lett 11: 1407-10 (2001)
BindingDB Entry DOI: 10.7270/Q2RB73WF