BDBM50100015 CHEMBL3321968
SMILES: CN1CCN(CC1)c1cc(Cl)c2nc(Nc3ccc(Br)cn3)[nH]c2c1
InChI Key: InChIKey=RFGXEYDQPWXCCL-UHFFFAOYSA-N
Data: 1 IC50
Activity Spreadsheet -- Enzyme Inhibition Constant Data from BindingDB
Found 1 hit for monomerid = 50100015
Trg + Lig
Ki
nM
ΔG°
kcal/mole
IC50
nM
Kd
nM
EC50/IC50
nM
koff
s-1
kon
M-1s-1
pHTemp
°C
Potassium voltage-gated channel subfamily H member 2
(Homo sapiens (Human))
BDBM50100015
(CHEMBL3321968)
Show SMILES CN1CCN(CC1)c1cc(Cl)c2nc(Nc3ccc(Br)cn3)[nH]c2c1
Show InChI InChI=1S/C17H18BrClN6/c1-24-4-6-25(7-5-24)12-8-13(19)16-14(9-12)21-17(23-16)22-15-3-2-11(18)10-20-15/h2-3,8-10H,4-7H2,1H3,(H2,20,21,22,23)
Reactome pathway
n/an/a 7.30E+3n/an/an/an/an/an/a
AstraZeneca
Curated by ChEMBL
Assay Description
Inhibition of human ERG
J Med Chem 57: 6642-52 (2014)
Article DOI: 10.1021/jm500715u
BindingDB Entry DOI: 10.7270/Q2377BG1