BDBM50100332 CHEMBL415843::RO-09-3655 derivative
SMILES: CCCCCCCCCCCCC[C@@H]1CC(=O)N[C@H]([C@@H](C)O)C(=O)N[C@H](C)C(=O)N[C@@H](Cc2ccc(O)cc2)C(=O)N[C@@H](C(C)C)C(=O)N2C[C@H](O)C[C@H]2C(=O)N[C@H]([C@@H](C)O)C(=O)N[C@@H]([C@@H](C)O)C(=O)N2CC[C@H](O)[C@H]2C(=O)N[C@@H]([C@H](O)CC(N)=O)C(=O)NCC(=O)N[C@H]([C@@H](C)O)C(=O)N[C@@H](CCCN(CCCN)C(=O)[C@H](CCCN)N(CCN)CCN)C(=O)O1
InChI Key: InChIKey=WRLKNYWWAPRBTD-MUYNXBBSSA-N
Data: 1 IC50
Activity Spreadsheet -- Enzyme Inhibition Constant Data from BindingDB
Found 1 hit for monomerid = 50100332
Trg + Lig
Ki
nM
ΔG°
kcal/mole
IC50
nM
Kd
nM
EC50/IC50
nM
koff
s-1
kon
M-1s-1
pHTemp
°C
Glucan Synthase
(Candida albicans (Yeast))
BDBM50100332
(CHEMBL415843 | RO-09-3655 derivative)
Show SMILES CCCCCCCCCCCCC[C@@H]1CC(=O)N[C@H]([C@@H](C)O)C(=O)N[C@H](C)C(=O)N[C@@H](Cc2ccc(O)cc2)C(=O)N[C@@H](C(C)C)C(=O)N2C[C@H](O)C[C@H]2C(=O)N[C@H]([C@@H](C)O)C(=O)N[C@@H]([C@@H](C)O)C(=O)N2CC[C@H](O)[C@H]2C(=O)N[C@@H]([C@H](O)CC(N)=O)C(=O)NCC(=O)N[C@H]([C@@H](C)O)C(=O)N[C@@H](CCCN(CCCN)C(=O)[C@H](CCCN)N(CCN)CCN)C(=O)O1
Show InChI InChI=1S/C83H143N19O24/c1-9-10-11-12-13-14-15-16-17-18-19-23-55-42-63(112)93-66(48(5)103)76(118)90-47(4)72(114)92-57(40-52-26-28-53(107)29-27-52)73(115)95-65(46(2)3)81(123)102-45-54(108)41-59(102)74(116)96-68(50(7)105)78(120)97-69(51(8)106)82(124)101-37-30-60(109)71(101)79(121)98-70(61(110)43-62(88)111)75(117)89-44-64(113)94-67(49(6)104)77(119)91-56(83(125)126-55)24-21-35-100(36-22-32-85)80(122)58(25-20-31-84)99(38-33-86)39-34-87/h26-29,46-51,54-61,65-71,103-110H,9-25,30-45,84-87H2,1-8H3,(H2,88,111)(H,89,117)(H,90,118)(H,91,119)(H,92,114)(H,93,112)(H,94,113)(H,95,115)(H,96,116)(H,97,120)(H,98,121)/t47-,48-,49-,50-,51-,54-,55-,56+,57+,58+,59+,60+,61-,65+,66-,67-,68-,69+,70+,71+/m1/s1
n/an/a 0.280n/an/an/an/an/an/a
Nippon Roche Research Center
Curated by ChEMBL
Assay Description
In vitro inhibitory activity against Beta glucan synthase
Bioorg Med Chem Lett 11: 1273-6 (2001)
BindingDB Entry DOI: 10.7270/Q2CN74FQ