BDBM50100334 CHEMBL407924::RO-09-3655 derivative
SMILES: CCCCCCCCCCCCC[C@@H]1CC(=O)N[C@H]([C@@H](C)O)C(=O)N[C@H](C)C(=O)N[C@@H](Cc2ccc(O)cc2)C(=O)N[C@@H](C(C)C)C(=O)N2C[C@H](O)C[C@H]2C(=O)N[C@H]([C@@H](C)O)C(=O)N[C@@H]([C@@H](C)O)C(=O)N2CC[C@H](O)[C@H]2C(=O)N[C@@H]([C@H](O)CC(N)=O)C(=O)NCC(=O)N[C@H]([C@@H](C)O)C(=O)N[C@@H](CCCNC(=O)[C@H](N)CCCN)C(=O)O1
InChI Key: InChIKey=QPXQVOQETWTFFY-FBMJCZFYSA-N
Data: 1 IC50
Activity Spreadsheet -- Enzyme Inhibition Constant Data from BindingDB
Found 1 hit for monomerid = 50100334
Trg + Lig
Ki
nM
ΔG°
kcal/mole
IC50
nM
Kd
nM
EC50/IC50
nM
koff
s-1
kon
M-1s-1
pHTemp
°C
Glucan Synthase
(Candida albicans (Yeast))
BDBM50100334
(CHEMBL407924 | RO-09-3655 derivative)
Show SMILES CCCCCCCCCCCCC[C@@H]1CC(=O)N[C@H]([C@@H](C)O)C(=O)N[C@H](C)C(=O)N[C@@H](Cc2ccc(O)cc2)C(=O)N[C@@H](C(C)C)C(=O)N2C[C@H](O)C[C@H]2C(=O)N[C@H]([C@@H](C)O)C(=O)N[C@@H]([C@@H](C)O)C(=O)N2CC[C@H](O)[C@H]2C(=O)N[C@@H]([C@H](O)CC(N)=O)C(=O)NCC(=O)N[C@H]([C@@H](C)O)C(=O)N[C@@H](CCCNC(=O)[C@H](N)CCCN)C(=O)O1
Show InChI InChI=1S/C76H126N16O24/c1-9-10-11-12-13-14-15-16-17-18-19-22-48-35-56(102)85-59(41(5)93)70(109)82-40(4)65(104)84-51(33-45-25-27-46(97)28-26-45)67(106)87-58(39(2)3)74(113)92-38-47(98)34-52(92)68(107)88-61(43(7)95)72(111)89-62(44(8)96)75(114)91-32-29-53(99)64(91)73(112)90-63(54(100)36-55(79)101)69(108)81-37-57(103)86-60(42(6)94)71(110)83-50(76(115)116-48)24-21-31-80-66(105)49(78)23-20-30-77/h25-28,39-44,47-54,58-64,93-100H,9-24,29-38,77-78H2,1-8H3,(H2,79,101)(H,80,105)(H,81,108)(H,82,109)(H,83,110)(H,84,104)(H,85,102)(H,86,103)(H,87,106)(H,88,107)(H,89,111)(H,90,112)/t40-,41-,42-,43-,44-,47-,48-,49-,50+,51+,52+,53+,54-,58+,59-,60-,61-,62+,63+,64+/m1/s1
n/an/a 3.60n/an/an/an/an/an/a
Nippon Roche Research Center
Curated by ChEMBL
Assay Description
In vitro inhibitory activity against Beta glucan synthase
Bioorg Med Chem Lett 11: 1273-6 (2001)
BindingDB Entry DOI: 10.7270/Q2CN74FQ